BDBM48789 2-tert-butyl-3-chloranyl-6-oxidanyl-1,5-diphenyl-pyridin-4-one::2-tert-butyl-3-chloro-6-hydroxy-1,5-diphenyl-4-pyridinone::2-tert-butyl-3-chloro-6-hydroxy-1,5-diphenyl-4-pyridone::2-tert-butyl-3-chloro-6-hydroxy-1,5-diphenylpyridin-4-one::6-tert-butyl-5-chloro-4-hydroxy-1,3-diphenyl-2(1H)-pyridinone::MLS000699569::SMR000224706::cid_1037184
SMILES: CC(C)(C)c1c(Cl)c(O)c(-c2ccccc2)c(=O)n1-c1ccccc1
InChI Key: InChIKey=SXCMNKSDLJDFTB-UHFFFAOYSA-N
Data: 3 IC50
Activity Spreadsheet -- Enzyme Inhibition Constant Data from BindingDB
Found 3 hits for monomerid = 48789
Trg + Lig
Ki
nM
ΔG°
kcal/mole
IC50
nM
Kd
nM
EC50/IC50
nM
koff
s-1
kon
M-1s-1
pHTemp
°C
eukaryotic translation initiation factor 4 gamma, 1 isoform 4
(Homo sapiens (Human))
BDBM48789
(2-tert-butyl-3-chloranyl-6-oxidanyl-1,5-diphenyl-p...)
Show SMILES CC(C)(C)c1c(Cl)c(O)c(-c2ccccc2)c(=O)n1-c1ccccc1
Show InChI InChI=1S/C21H20ClNO2/c1-21(2,3)19-17(22)18(24)16(14-10-6-4-7-11-14)20(25)23(19)15-12-8-5-9-13-15/h4-13,24H,1-3H3
Reactome pathway
PCBioAssay
n/an/a 1.41E+4n/an/an/an/an/an/a
Emory University Molecular Libraries Screening Center
Curated by PubChem BioAssay
Assay Description
Dose Response Confirmation for Small Molecule Inhibitors of Eukaryotic Translation Initiation NIH Molecular Libraries Screening Centers Network [MLSC...
PubChem Bioassay (2009)
BindingDB Entry DOI: 10.7270/Q2RN3686
putative hexokinase HKDC1
(Homo sapiens (Human))
BDBM48789
(2-tert-butyl-3-chloranyl-6-oxidanyl-1,5-diphenyl-p...)
Show SMILES CC(C)(C)c1c(Cl)c(O)c(-c2ccccc2)c(=O)n1-c1ccccc1
Show InChI InChI=1S/C21H20ClNO2/c1-21(2,3)19-17(22)18(24)16(14-10-6-4-7-11-14)20(25)23(19)15-12-8-5-9-13-15/h4-13,24H,1-3H3
PCBioAssay
n/an/a 8.00E+4n/an/an/an/an/an/a
Burnham Center for Chemical Genomics
Curated by PubChem BioAssay
Assay Description
Data Source: Sanford-Burnham Center for Chemical Genomics (SBCCG) Source Affiliation: Sanford-Burnham Medical Research Institute (SBMRI, San Diego, C...
PubChem Bioassay (2011)
BindingDB Entry DOI: 10.7270/Q23F4N3R
putative hexokinase HKDC1
(Homo sapiens (Human))
BDBM48789
(2-tert-butyl-3-chloranyl-6-oxidanyl-1,5-diphenyl-p...)
Show SMILES CC(C)(C)c1c(Cl)c(O)c(-c2ccccc2)c(=O)n1-c1ccccc1
Show InChI InChI=1S/C21H20ClNO2/c1-21(2,3)19-17(22)18(24)16(14-10-6-4-7-11-14)20(25)23(19)15-12-8-5-9-13-15/h4-13,24H,1-3H3
PCBioAssay
n/an/a 8.83E+3n/an/an/an/an/an/a
Burnham Center for Chemical Genomics
Curated by PubChem BioAssay
Assay Description
Data Source: Sanford-Burnham Center for Chemical Genomics (SBCCG) Source Affiliation: Sanford-Burnham Medical Research Institute (SBMRI, San Diego, C...
PubChem Bioassay (2011)
BindingDB Entry DOI: 10.7270/Q2W094D4