BDBM4881 1-(3-Trifluormethyl-5-fluoroanilino)-4-(4-pyridylmethyl)phthalazine::CGP79787 Analog 66::N-[3-fluoro-5-(trifluoromethyl)phenyl]-4-(pyridin-4-ylmethyl)phthalazin-1-amine
SMILES: Fc1cc(Nc2nnc(Cc3ccncc3)c3ccccc23)cc(c1)C(F)(F)F
InChI Key: InChIKey=FZROGUOMLPOFBV-UHFFFAOYSA-N
Data: 4 IC50
Activity Spreadsheet -- Enzyme Inhibition Constant Data from BindingDB
Found 4 hits for monomerid = 4881
Trg + Lig
Ki
nM
ΔG°
kcal/mole
IC50
nM
Kd
nM
EC50/IC50
nM
koff
s-1
kon
M-1s-1
pHTemp
°C
Vascular endothelial growth factor receptor 1
(Homo sapiens (Human))
BDBM4881
(1-(3-Trifluormethyl-5-fluoroanilino)-4-(4-pyridylm...)
Show SMILES Fc1cc(Nc2nnc(Cc3ccncc3)c3ccccc23)cc(c1)C(F)(F)F
Show InChI InChI=1S/C21H14F4N4/c22-15-10-14(21(23,24)25)11-16(12-15)27-20-18-4-2-1-3-17(18)19(28-29-20)9-13-5-7-26-8-6-13/h1-8,10-12H,9H2,(H,27,29)
n/an/a 350n/an/an/an/an/an/a
Novartis Pharmaceuticals
Assay Description
The in vitro kinase assays were performed in 96-well plates using the recombinant GST-fused kinase domains expressed in baculovirus and purified over...
J Med Chem 43: 2310-23 (2000)
Article DOI: 10.1021/jm9909443
BindingDB Entry DOI: 10.7270/Q24M92R5
Mast/stem cell growth factor receptor Kit
(Homo sapiens (Human))
BDBM4881
(1-(3-Trifluormethyl-5-fluoroanilino)-4-(4-pyridylm...)
Show SMILES Fc1cc(Nc2nnc(Cc3ccncc3)c3ccccc23)cc(c1)C(F)(F)F
Show InChI InChI=1S/C21H14F4N4/c22-15-10-14(21(23,24)25)11-16(12-15)27-20-18-4-2-1-3-17(18)19(28-29-20)9-13-5-7-26-8-6-13/h1-8,10-12H,9H2,(H,27,29)
n/an/a>1.00E+4n/an/an/an/an/an/a
Novartis Pharmaceuticals
Assay Description
The in vitro kinase assays were performed in 96-well plates using the recombinant GST-fused kinase domains expressed in baculovirus and purified over...
J Med Chem 43: 2310-23 (2000)
Article DOI: 10.1021/jm9909443
BindingDB Entry DOI: 10.7270/Q24M92R5
Platelet-derived growth factor receptor beta
(Homo sapiens (Human))
BDBM4881
(1-(3-Trifluormethyl-5-fluoroanilino)-4-(4-pyridylm...)
Show SMILES Fc1cc(Nc2nnc(Cc3ccncc3)c3ccccc23)cc(c1)C(F)(F)F
Show InChI InChI=1S/C21H14F4N4/c22-15-10-14(21(23,24)25)11-16(12-15)27-20-18-4-2-1-3-17(18)19(28-29-20)9-13-5-7-26-8-6-13/h1-8,10-12H,9H2,(H,27,29)
NCI pathway
Reactome pathway
n/an/a>1.00E+4n/an/an/an/an/an/a
Novartis Pharmaceuticals
Assay Description
The autophosphorylation assay was performed in 96-well plates using the recombinant GST-fused kinase domains expressed in baculovirus and purified ov...
J Med Chem 43: 2310-23 (2000)
Article DOI: 10.1021/jm9909443
BindingDB Entry DOI: 10.7270/Q24M92R5
Vascular endothelial growth factor receptor 2
(Homo sapiens (Human))
BDBM4881
(1-(3-Trifluormethyl-5-fluoroanilino)-4-(4-pyridylm...)
Show SMILES Fc1cc(Nc2nnc(Cc3ccncc3)c3ccccc23)cc(c1)C(F)(F)F
Show InChI InChI=1S/C21H14F4N4/c22-15-10-14(21(23,24)25)11-16(12-15)27-20-18-4-2-1-3-17(18)19(28-29-20)9-13-5-7-26-8-6-13/h1-8,10-12H,9H2,(H,27,29)
NCI pathway
Reactome pathway
n/an/a 200n/an/an/an/an/an/a
Novartis Pharmaceuticals
Assay Description
The in vitro kinase assays were performed in 96-well plates using the recombinant GST-fused kinase domains expressed in baculovirus and purified over...
J Med Chem 43: 2310-23 (2000)
Article DOI: 10.1021/jm9909443
BindingDB Entry DOI: 10.7270/Q24M92R5