BDBM4883 3-(4-methyl-2-{[(3Z)-4-methyl-2-oxo-2,3-dihydro-1H-indol-3-ylidene]methyl}-1H-pyrrol-3-yl)propanoic acid::3-substituted indolin-2-one 9a::SU5402 analog 9a
SMILES: Cc1c[nH]c(\C=C2/C(=O)Nc3cccc(C)c23)c1CCC(O)=O
InChI Key: InChIKey=WFEYKXAXXWJCGD-JYRVWZFOSA-N
Data: 4 IC50
PDB links: 1 PDB ID contains inhibitors having a similarity of 90% to this monomer.
Activity Spreadsheet -- Enzyme Inhibition Constant Data from BindingDB
Found 4 hits for monomerid = 4883
Trg + Lig
Ki
nM
ΔG°
kcal/mole
IC50
nM
Kd
nM
EC50/IC50
nM
koff
s-1
kon
M-1s-1
pHTemp
°C
Vascular endothelial growth factor receptor 2
(Homo sapiens (Human))
BDBM4883
(3-(4-methyl-2-{[(3Z)-4-methyl-2-oxo-2,3-dihydro-1H...)
Show SMILES Cc1c[nH]c(\C=C2/C(=O)Nc3cccc(C)c23)c1CCC(O)=O
Show InChI InChI=1S/C18H18N2O3/c1-10-4-3-5-14-17(10)13(18(23)20-14)8-15-12(6-7-16(21)22)11(2)9-19-15/h3-5,8-9,19H,6-7H2,1-2H3,(H,20,23)(H,21,22)/b13-8-
NCI pathway
Reactome pathway
n/an/a 200n/an/an/an/a7.522
SUGEN, Inc.
Assay Description
The assays were performed in 96-well microtiter plates that had been coated with a polyGluTyr peptide. Negative control wells received buffer alone w...
J Med Chem 42: 5120-30 (1999)
Article DOI: 10.1021/jm9904295
BindingDB Entry DOI: 10.7270/Q20Z71GM
Epidermal growth factor receptor
(Homo sapiens (Human))
BDBM4883
(3-(4-methyl-2-{[(3Z)-4-methyl-2-oxo-2,3-dihydro-1H...)
Show SMILES Cc1c[nH]c(\C=C2/C(=O)Nc3cccc(C)c23)c1CCC(O)=O
Show InChI InChI=1S/C18H18N2O3/c1-10-4-3-5-14-17(10)13(18(23)20-14)8-15-12(6-7-16(21)22)11(2)9-19-15/h3-5,8-9,19H,6-7H2,1-2H3,(H,20,23)(H,21,22)/b13-8-
n/an/a>1.00E+5n/an/an/an/an/an/a
SUGEN, Inc.
Assay Description
IC50 is the inhibitor concentration which inhibits 50% of EGF-R or PDGFR-beta kinase autophosphorylation activity. The assay was performed in 96-well...
J Med Chem 42: 5120-30 (1999)
Article DOI: 10.1021/jm9904295
BindingDB Entry DOI: 10.7270/Q20Z71GM
Platelet-derived growth factor receptor beta
(Homo sapiens (Human))
BDBM4883
(3-(4-methyl-2-{[(3Z)-4-methyl-2-oxo-2,3-dihydro-1H...)
Show SMILES Cc1c[nH]c(\C=C2/C(=O)Nc3cccc(C)c23)c1CCC(O)=O
Show InChI InChI=1S/C18H18N2O3/c1-10-4-3-5-14-17(10)13(18(23)20-14)8-15-12(6-7-16(21)22)11(2)9-19-15/h3-5,8-9,19H,6-7H2,1-2H3,(H,20,23)(H,21,22)/b13-8-
NCI pathway
Reactome pathway
n/an/a 2.11E+3n/an/an/an/an/an/a
SUGEN, Inc.
Assay Description
IC50 is the inhibitor concentration which inhibits 50% of EGF-R or PDGFR-beta kinase autophosphorylation activity. The assay was performed in 96-well...
J Med Chem 42: 5120-30 (1999)
Article DOI: 10.1021/jm9904295
BindingDB Entry DOI: 10.7270/Q20Z71GM
Fibroblast growth factor receptor 1
(Homo sapiens (Human))
BDBM4883
(3-(4-methyl-2-{[(3Z)-4-methyl-2-oxo-2,3-dihydro-1H...)
Show SMILES Cc1c[nH]c(\C=C2/C(=O)Nc3cccc(C)c23)c1CCC(O)=O
Show InChI InChI=1S/C18H18N2O3/c1-10-4-3-5-14-17(10)13(18(23)20-14)8-15-12(6-7-16(21)22)11(2)9-19-15/h3-5,8-9,19H,6-7H2,1-2H3,(H,20,23)(H,21,22)/b13-8-
NCI pathway
Reactome pathway
n/an/a 30n/an/an/an/an/an/a
SUGEN, Inc.
Assay Description
The assays were performed in 96-well microtiter plates that had been coated with a polyGluTyr peptide. Negative control wells received buffer alone w...
J Med Chem 42: 5120-30 (1999)
Article DOI: 10.1021/jm9904295
BindingDB Entry DOI: 10.7270/Q20Z71GM