BDBM4885 3-(2-{[(3Z)-6-(3-methoxyphenyl)-2-oxo-2,3-dihydro-1H-indol-3-ylidene]methyl}-4-methyl-1H-pyrrol-3-yl)propanoic acid::3-substituted indolin-2-one 9c::SU5402 analog 9c
SMILES: COc1cccc(c1)-c1ccc2\C(=C\c3[nH]cc(C)c3CCC(O)=O)C(=O)Nc2c1
InChI Key: InChIKey=JDISROKFUAYCBM-NDENLUEZSA-N
Data: 4 IC50
PDB links: 1 PDB ID contains inhibitors having a similarity of 90% to this monomer.
Activity Spreadsheet -- Enzyme Inhibition Constant Data from BindingDB
Found 4 hits for monomerid = 4885
Trg + Lig
Ki
nM
ΔG°
kcal/mole
IC50
nM
Kd
nM
EC50/IC50
nM
koff
s-1
kon
M-1s-1
pHTemp
°C
Vascular endothelial growth factor receptor 2
(Homo sapiens (Human))
BDBM4885
(3-(2-{[(3Z)-6-(3-methoxyphenyl)-2-oxo-2,3-dihydro-...)
Show SMILES COc1cccc(c1)-c1ccc2\C(=C\c3[nH]cc(C)c3CCC(O)=O)C(=O)Nc2c1
Show InChI InChI=1S/C24H22N2O4/c1-14-13-25-21(18(14)8-9-23(27)28)12-20-19-7-6-16(11-22(19)26-24(20)29)15-4-3-5-17(10-15)30-2/h3-7,10-13,25H,8-9H2,1-2H3,(H,26,29)(H,27,28)/b20-12-
NCI pathway
Reactome pathway
n/an/a 2.83E+4n/an/an/an/a7.522
SUGEN, Inc.
Assay Description
The assays were performed in 96-well microtiter plates that had been coated with a polyGluTyr peptide. Negative control wells received buffer alone w...
J Med Chem 42: 5120-30 (1999)
Article DOI: 10.1021/jm9904295
BindingDB Entry DOI: 10.7270/Q20Z71GM
Epidermal growth factor receptor
(Homo sapiens (Human))
BDBM4885
(3-(2-{[(3Z)-6-(3-methoxyphenyl)-2-oxo-2,3-dihydro-...)
Show SMILES COc1cccc(c1)-c1ccc2\C(=C\c3[nH]cc(C)c3CCC(O)=O)C(=O)Nc2c1
Show InChI InChI=1S/C24H22N2O4/c1-14-13-25-21(18(14)8-9-23(27)28)12-20-19-7-6-16(11-22(19)26-24(20)29)15-4-3-5-17(10-15)30-2/h3-7,10-13,25H,8-9H2,1-2H3,(H,26,29)(H,27,28)/b20-12-
n/an/a>1.00E+5n/an/an/an/an/an/a
SUGEN, Inc.
Assay Description
IC50 is the inhibitor concentration which inhibits 50% of EGF-R or PDGFR-beta kinase autophosphorylation activity. The assay was performed in 96-well...
J Med Chem 42: 5120-30 (1999)
Article DOI: 10.1021/jm9904295
BindingDB Entry DOI: 10.7270/Q20Z71GM
Platelet-derived growth factor receptor beta
(Homo sapiens (Human))
BDBM4885
(3-(2-{[(3Z)-6-(3-methoxyphenyl)-2-oxo-2,3-dihydro-...)
Show SMILES COc1cccc(c1)-c1ccc2\C(=C\c3[nH]cc(C)c3CCC(O)=O)C(=O)Nc2c1
Show InChI InChI=1S/C24H22N2O4/c1-14-13-25-21(18(14)8-9-23(27)28)12-20-19-7-6-16(11-22(19)26-24(20)29)15-4-3-5-17(10-15)30-2/h3-7,10-13,25H,8-9H2,1-2H3,(H,26,29)(H,27,28)/b20-12-
NCI pathway
Reactome pathway
n/an/a 450n/an/an/an/an/an/a
SUGEN, Inc.
Assay Description
IC50 is the inhibitor concentration which inhibits 50% of EGF-R or PDGFR-beta kinase autophosphorylation activity. The assay was performed in 96-well...
J Med Chem 42: 5120-30 (1999)
Article DOI: 10.1021/jm9904295
BindingDB Entry DOI: 10.7270/Q20Z71GM
Fibroblast growth factor receptor 1
(Homo sapiens (Human))
BDBM4885
(3-(2-{[(3Z)-6-(3-methoxyphenyl)-2-oxo-2,3-dihydro-...)
Show SMILES COc1cccc(c1)-c1ccc2\C(=C\c3[nH]cc(C)c3CCC(O)=O)C(=O)Nc2c1
Show InChI InChI=1S/C24H22N2O4/c1-14-13-25-21(18(14)8-9-23(27)28)12-20-19-7-6-16(11-22(19)26-24(20)29)15-4-3-5-17(10-15)30-2/h3-7,10-13,25H,8-9H2,1-2H3,(H,26,29)(H,27,28)/b20-12-
NCI pathway
Reactome pathway
n/an/a 1.20E+3n/an/an/an/an/an/a
SUGEN, Inc.
Assay Description
The assays were performed in 96-well microtiter plates that had been coated with a polyGluTyr peptide. Negative control wells received buffer alone w...
J Med Chem 42: 5120-30 (1999)
Article DOI: 10.1021/jm9904295
BindingDB Entry DOI: 10.7270/Q20Z71GM