BDBM48853 (6E)-2-(2-furanyl)-5-imino-6-[[1-(4-methoxyphenyl)-2-pyrrolyl]methylidene]-[1,3,4]thiadiazolo[3,2-a]pyrimidin-7-one::(6E)-2-(2-furyl)-5-imino-6-[[1-(4-methoxyphenyl)pyrrol-2-yl]methylene]-[1,3,4]thiadiazolo[3,2-a]pyrimidin-7-one::(6E)-2-(2-furyl)-5-imino-6-{[1-(4-methoxyphenyl)-1H-pyrrol-2-yl]methylene}-5,6-dihydro-7H-[1,3,4]thiadiazolo[3,2-a]pyrimidin-7-one::(6E)-2-(furan-2-yl)-5-imino-6-[[1-(4-methoxyphenyl)pyrrol-2-yl]methylidene]-[1,3,4]thiadiazolo[3,2-a]pyrimidin-7-one::(6E)-5-azanylidene-2-(furan-2-yl)-6-[[1-(4-methoxyphenyl)pyrrol-2-yl]methylidene]-[1,3,4]thiadiazolo[3,2-a]pyrimidin-7-one::MLS000871656::SMR000309175::cid_16194416
SMILES: COc1ccc(cc1)-n1cccc1\C=C1\C(=O)N=C2SC(=NN2C1=N)c1ccco1
InChI Key: InChIKey=TYNJPKWWVKKUQA-ISFDWQSPSA-N
Data: 12 IC50
Activity Spreadsheet -- Enzyme Inhibition Constant Data from BindingDB
Found 12 hits for monomerid = 48853
Trg + Lig
Ki
nM
ΔG°
kcal/mole
IC50
nM
Kd
nM
EC50/IC50
nM
koff
s-1
kon
M-1s-1
pHTemp
°C
eukaryotic translation initiation factor 4 gamma, 1 isoform 4
(Homo sapiens (Human))
BDBM48853
((6E)-2-(2-furanyl)-5-imino-6-[[1-(4-methoxyphenyl)...)
Show SMILES COc1ccc(cc1)-n1cccc1\C=C1\C(=O)N=C2SC(=NN2C1=N)c1ccco1 |c:22,t:19|
Show InChI InChI=1S/C21H15N5O3S/c1-28-15-8-6-13(7-9-15)25-10-2-4-14(25)12-16-18(22)26-21(23-19(16)27)30-20(24-26)17-5-3-11-29-17/h2-12,22H,1H3/b16-12+,22-18?
Reactome pathway
PCBioAssay
n/an/a 5.00E+4n/an/an/an/an/an/a
Emory University Molecular Libraries Screening Center
Curated by PubChem BioAssay
Assay Description
Dose Response Confirmation for Small Molecule Inhibitors of Eukaryotic Translation Initiation NIH Molecular Libraries Screening Centers Network [MLSC...
PubChem Bioassay (2009)
BindingDB Entry DOI: 10.7270/Q2RN3686
BZLF2
(Human herpesvirus 4 type 2)
BDBM48853
((6E)-2-(2-furanyl)-5-imino-6-[[1-(4-methoxyphenyl)...)
Show SMILES COc1ccc(cc1)-n1cccc1\C=C1\C(=O)N=C2SC(=NN2C1=N)c1ccco1 |c:22,t:19|
Show InChI InChI=1S/C21H15N5O3S/c1-28-15-8-6-13(7-9-15)25-10-2-4-14(25)12-16-18(22)26-21(23-19(16)27)30-20(24-26)17-5-3-11-29-17/h2-12,22H,1H3/b16-12+,22-18?
PCBioAssay
n/an/a 2.02E+3n/an/an/an/an/an/a
Emory University Molecular Libraries Screening Center
Curated by PubChem BioAssay
Assay Description
NIH Molecular Libraries Screening Centers Network [MLSCN] Emory Chemical Biology Discovery Center in MLSCN Assay provider: Theodore Jardetzky; Northw...
PubChem Bioassay (2008)
BindingDB Entry DOI: 10.7270/Q2057DCW
MKP-3
(Rattus norvegicus)
BDBM48853
((6E)-2-(2-furanyl)-5-imino-6-[[1-(4-methoxyphenyl)...)
Show SMILES COc1ccc(cc1)-n1cccc1\C=C1\C(=O)N=C2SC(=NN2C1=N)c1ccco1 |c:22,t:19|
Show InChI InChI=1S/C21H15N5O3S/c1-28-15-8-6-13(7-9-15)25-10-2-4-14(25)12-16-18(22)26-21(23-19(16)27)30-20(24-26)17-5-3-11-29-17/h2-12,22H,1H3/b16-12+,22-18?
Reactome pathway
PCBioAssay
n/an/a 9.04E+3n/an/an/an/an/an/a
Sanford-Burnham Center for Chemical Genomics
Curated by PubChem BioAssay
Assay Description
Data Source: Sanford-Burnham Center for Chemical Genomics (SBCCG) Source Affiliation: Sanford-Burnham Medical Research Institute (SBMRI, San Diego, C...
PubChem Bioassay (2009)
BindingDB Entry DOI: 10.7270/Q2W66J6B
Induced myeloid leukemia cell differentiation protein Mcl-1
(Homo sapiens (Human))
BDBM48853
((6E)-2-(2-furanyl)-5-imino-6-[[1-(4-methoxyphenyl)...)
Show SMILES COc1ccc(cc1)-n1cccc1\C=C1\C(=O)N=C2SC(=NN2C1=N)c1ccco1 |c:22,t:19|
Show InChI InChI=1S/C21H15N5O3S/c1-28-15-8-6-13(7-9-15)25-10-2-4-14(25)12-16-18(22)26-21(23-19(16)27)30-20(24-26)17-5-3-11-29-17/h2-12,22H,1H3/b16-12+,22-18?
NCI pathway
PCBioAssay
n/an/a 1.93E+4n/an/an/an/an/an/a
Emory University Molecular Libraries Screening Center
Curated by PubChem BioAssay
Assay Description
NIH Molecular Libraries Screening Centers Network [MLSCN] Emory Chemical Biology Discovery Center in MLSCN Assay provider: Nikolovska-Coleska, Univer...
PubChem Bioassay (2008)
BindingDB Entry DOI: 10.7270/Q23X8539
Dual specificity protein phosphatase (VHR)
(Homo sapiens (Human))
BDBM48853
((6E)-2-(2-furanyl)-5-imino-6-[[1-(4-methoxyphenyl)...)
Show SMILES COc1ccc(cc1)-n1cccc1\C=C1\C(=O)N=C2SC(=NN2C1=N)c1ccco1 |c:22,t:19|
Show InChI InChI=1S/C21H15N5O3S/c1-28-15-8-6-13(7-9-15)25-10-2-4-14(25)12-16-18(22)26-21(23-19(16)27)30-20(24-26)17-5-3-11-29-17/h2-12,22H,1H3/b16-12+,22-18?
Reactome pathway
PCBioAssay
n/an/a 2.27E+3n/an/an/an/an/an/a
Burnham Center for Chemical Genomics
Curated by PubChem BioAssay
Assay Description
Data Source: Sanford-Burnham Center for Chemical Genomics (SBCCG) Source Affiliation: Sanford-Burnham Medical Research Institute (SBMRI, San Diego, C...
PubChem Bioassay (2009)
BindingDB Entry DOI: 10.7270/Q29G5K79
Phospholipase A2
(Homo sapiens (Human))
BDBM48853
((6E)-2-(2-furanyl)-5-imino-6-[[1-(4-methoxyphenyl)...)
Show SMILES COc1ccc(cc1)-n1cccc1\C=C1\C(=O)N=C2SC(=NN2C1=N)c1ccco1 |c:22,t:19|
Show InChI InChI=1S/C21H15N5O3S/c1-28-15-8-6-13(7-9-15)25-10-2-4-14(25)12-16-18(22)26-21(23-19(16)27)30-20(24-26)17-5-3-11-29-17/h2-12,22H,1H3/b16-12+,22-18?
Reactome pathway
PCBioAssay
n/an/a 1.09E+3n/an/an/an/an/an/a
Burnham Center for Chemical Genomics
Curated by PubChem BioAssay
Assay Description
Data Source: Sanford-Burnham Center for Chemical Genomics (SBCCG) Source Affiliation: Sanford-Burnham Medical Research Institute (SBMRI, San Diego, C...
PubChem Bioassay (2011)
BindingDB Entry DOI: 10.7270/Q26M35BC
Dual specificity protein phosphatase (VHR)
(Homo sapiens (Human))
BDBM48853
((6E)-2-(2-furanyl)-5-imino-6-[[1-(4-methoxyphenyl)...)
Show SMILES COc1ccc(cc1)-n1cccc1\C=C1\C(=O)N=C2SC(=NN2C1=N)c1ccco1 |c:22,t:19|
Show InChI InChI=1S/C21H15N5O3S/c1-28-15-8-6-13(7-9-15)25-10-2-4-14(25)12-16-18(22)26-21(23-19(16)27)30-20(24-26)17-5-3-11-29-17/h2-12,22H,1H3/b16-12+,22-18?
Reactome pathway
PCBioAssay
n/an/a 6.65E+3n/an/an/an/an/an/a
Burnham Center for Chemical Genomics
Curated by PubChem BioAssay
Assay Description
Data Source: Sanford-Burnham Center for Chemical Genomics (SBCCG) Source Affiliation: Sanford-Burnham Medical Research Institute (SBMRI, San Diego, C...
PubChem Bioassay (2009)
BindingDB Entry DOI: 10.7270/Q2445JXV
Voltage-gated calcium channel subunit alpha Cav2.2
(Homo sapiens (Human))
BDBM48853
((6E)-2-(2-furanyl)-5-imino-6-[[1-(4-methoxyphenyl)...)
Show SMILES COc1ccc(cc1)-n1cccc1\C=C1\C(=O)N=C2SC(=NN2C1=N)c1ccco1 |c:22,t:19|
Show InChI InChI=1S/C21H15N5O3S/c1-28-15-8-6-13(7-9-15)25-10-2-4-14(25)12-16-18(22)26-21(23-19(16)27)30-20(24-26)17-5-3-11-29-17/h2-12,22H,1H3/b16-12+,22-18?
PCBioAssay
n/an/a 1.41E+4n/an/an/an/an/an/a
Burnham Center for Chemical Genomics
Curated by PubChem BioAssay
Assay Description
Data Source: Data Source: Sanford-Burnham Center for Chemical Genomics (SBCCG) Source Affiliation: Sanford-Burnham Medical Research Institute Network...
PubChem Bioassay (2009)
BindingDB Entry DOI: 10.7270/Q2PZ578V
Induced myeloid leukemia cell differentiation protein Mcl-1
(Homo sapiens (Human))
BDBM48853
((6E)-2-(2-furanyl)-5-imino-6-[[1-(4-methoxyphenyl)...)
Show SMILES COc1ccc(cc1)-n1cccc1\C=C1\C(=O)N=C2SC(=NN2C1=N)c1ccco1 |c:22,t:19|
Show InChI InChI=1S/C21H15N5O3S/c1-28-15-8-6-13(7-9-15)25-10-2-4-14(25)12-16-18(22)26-21(23-19(16)27)30-20(24-26)17-5-3-11-29-17/h2-12,22H,1H3/b16-12+,22-18?
NCI pathway
PCBioAssay
n/an/a 4.94E+3n/an/an/an/an/an/a
The Scripps Research Institute Molecular Screening Center
Curated by PubChem BioAssay
Assay Description
Source (MLPCN Center Name): The Scripps Research Institute Molecular Screening Center Affiliation: The Scripps Research Institute, TSRI Assay Provide...
PubChem Bioassay (2009)
BindingDB Entry DOI: 10.7270/Q2J67FCM
Bcl-2-like protein 1
(Homo sapiens (Human))
BDBM48853
((6E)-2-(2-furanyl)-5-imino-6-[[1-(4-methoxyphenyl)...)
Show SMILES COc1ccc(cc1)-n1cccc1\C=C1\C(=O)N=C2SC(=NN2C1=N)c1ccco1 |c:22,t:19|
Show InChI InChI=1S/C21H15N5O3S/c1-28-15-8-6-13(7-9-15)25-10-2-4-14(25)12-16-18(22)26-21(23-19(16)27)30-20(24-26)17-5-3-11-29-17/h2-12,22H,1H3/b16-12+,22-18?
NCI pathway
Reactome pathway
PCBioAssay
n/an/a 1.09E+5n/an/an/an/an/an/a
The Scripps Research Institute Molecular Screening Center
Curated by PubChem BioAssay
Assay Description
Source (MLPCN Center Name): The Scripps Research Institute Molecular Screening Center Affiliation: The Scripps Research Institute, TSRI Assay Provide...
PubChem Bioassay (2009)
BindingDB Entry DOI: 10.7270/Q2DF6PNW
cysteine protease ATG4B isoform a
(Homo sapiens (Human))
BDBM48853
((6E)-2-(2-furanyl)-5-imino-6-[[1-(4-methoxyphenyl)...)
Show SMILES COc1ccc(cc1)-n1cccc1\C=C1\C(=O)N=C2SC(=NN2C1=N)c1ccco1 |c:22,t:19|
Show InChI InChI=1S/C21H15N5O3S/c1-28-15-8-6-13(7-9-15)25-10-2-4-14(25)12-16-18(22)26-21(23-19(16)27)30-20(24-26)17-5-3-11-29-17/h2-12,22H,1H3/b16-12+,22-18?
PCBioAssay
n/an/a 2.73E+3n/an/an/an/an/an/a
Burnham Center for Chemical Genomics
Curated by PubChem BioAssay
Assay Description
Data Source: Sanford-Burnham Center for Chemical Genomics (SBCCG) Source Affiliation: Sanford-Burnham Medical Research Institute (SBMRI, San Diego, C...
PubChem Bioassay (2011)
BindingDB Entry DOI: 10.7270/Q2BZ64H1
NS3
(Hepatitis C virus)
BDBM48853
((6E)-2-(2-furanyl)-5-imino-6-[[1-(4-methoxyphenyl)...)
Show SMILES COc1ccc(cc1)-n1cccc1\C=C1\C(=O)N=C2SC(=NN2C1=N)c1ccco1 |c:22,t:19|
Show InChI InChI=1S/C21H15N5O3S/c1-28-15-8-6-13(7-9-15)25-10-2-4-14(25)12-16-18(22)26-21(23-19(16)27)30-20(24-26)17-5-3-11-29-17/h2-12,22H,1H3/b16-12+,22-18?
PCBioAssay
n/an/a 7.79E+3n/an/an/an/an/an/a
The Scripps Research Institute Molecular Screening Center
Curated by PubChem BioAssay
Assay Description
Source (MLPCN Center Name): The Scripps Research Institute Molecular Screening Center (SRIMSC) Center Affiliation: The Scripps Research Institute (TS...
PubChem Bioassay (2009)
BindingDB Entry DOI: 10.7270/Q2XS5ST3