BDBM4898 3-(2,4-dimethyl-5-{[(3Z)-2-oxo-5-sulfamoyl-2,3-dihydro-1H-indol-3-ylidene]methyl}-1H-pyrrol-3-yl)propanoic acid::3-substituted indolin-2-one 16d
SMILES: Cc1[nH]c(\C=C2/C(=O)Nc3ccc(cc23)S(N)(=O)=O)c(C)c1CCC(O)=O
InChI Key: InChIKey=NCORNUPANAVMRQ-ZSOIEALJSA-N
Data: 4 IC50
Activity Spreadsheet -- Enzyme Inhibition Constant Data from BindingDB
Found 4 hits for monomerid = 4898
Trg + Lig
Ki
nM
ΔG°
kcal/mole
IC50
nM
Kd
nM
EC50/IC50
nM
koff
s-1
kon
M-1s-1
pHTemp
°C
Vascular endothelial growth factor receptor 2
(Homo sapiens (Human))
BDBM4898
(3-(2,4-dimethyl-5-{[(3Z)-2-oxo-5-sulfamoyl-2,3-dih...)
Show SMILES Cc1[nH]c(\C=C2/C(=O)Nc3ccc(cc23)S(N)(=O)=O)c(C)c1CCC(O)=O
Show InChI InChI=1S/C18H19N3O5S/c1-9-12(4-6-17(22)23)10(2)20-16(9)8-14-13-7-11(27(19,25)26)3-5-15(13)21-18(14)24/h3,5,7-8,20H,4,6H2,1-2H3,(H,21,24)(H,22,23)(H2,19,25,26)/b14-8-
NCI pathway
Reactome pathway
n/an/a 1.26E+3n/an/an/an/an/an/a
SUGEN, Inc.
Assay Description
The assays were performed in 96-well microtiter plates that had been coated with a polyGluTyr peptide. Negative control wells received buffer alone w...
J Med Chem 42: 5120-30 (1999)
Article DOI: 10.1021/jm9904295
BindingDB Entry DOI: 10.7270/Q20Z71GM
Epidermal growth factor receptor
(Homo sapiens (Human))
BDBM4898
(3-(2,4-dimethyl-5-{[(3Z)-2-oxo-5-sulfamoyl-2,3-dih...)
Show SMILES Cc1[nH]c(\C=C2/C(=O)Nc3ccc(cc23)S(N)(=O)=O)c(C)c1CCC(O)=O
Show InChI InChI=1S/C18H19N3O5S/c1-9-12(4-6-17(22)23)10(2)20-16(9)8-14-13-7-11(27(19,25)26)3-5-15(13)21-18(14)24/h3,5,7-8,20H,4,6H2,1-2H3,(H,21,24)(H,22,23)(H2,19,25,26)/b14-8-
n/an/a 8.48E+4n/an/an/an/an/an/a
SUGEN, Inc.
Assay Description
IC50 is the inhibitor concentration which inhibits 50% of EGF-R or PDGFR-beta kinase autophosphorylation activity. The assay was performed in 96-well...
J Med Chem 42: 5120-30 (1999)
Article DOI: 10.1021/jm9904295
BindingDB Entry DOI: 10.7270/Q20Z71GM
Platelet-derived growth factor receptor beta
(Homo sapiens (Human))
BDBM4898
(3-(2,4-dimethyl-5-{[(3Z)-2-oxo-5-sulfamoyl-2,3-dih...)
Show SMILES Cc1[nH]c(\C=C2/C(=O)Nc3ccc(cc23)S(N)(=O)=O)c(C)c1CCC(O)=O
Show InChI InChI=1S/C18H19N3O5S/c1-9-12(4-6-17(22)23)10(2)20-16(9)8-14-13-7-11(27(19,25)26)3-5-15(13)21-18(14)24/h3,5,7-8,20H,4,6H2,1-2H3,(H,21,24)(H,22,23)(H2,19,25,26)/b14-8-
NCI pathway
Reactome pathway
n/an/a 1.53E+3n/an/an/an/an/an/a
SUGEN, Inc.
Assay Description
IC50 is the inhibitor concentration which inhibits 50% of EGF-R or PDGFR-beta kinase autophosphorylation activity. The assay was performed in 96-well...
J Med Chem 42: 5120-30 (1999)
Article DOI: 10.1021/jm9904295
BindingDB Entry DOI: 10.7270/Q20Z71GM
Fibroblast growth factor receptor 1
(Homo sapiens (Human))
BDBM4898
(3-(2,4-dimethyl-5-{[(3Z)-2-oxo-5-sulfamoyl-2,3-dih...)
Show SMILES Cc1[nH]c(\C=C2/C(=O)Nc3ccc(cc23)S(N)(=O)=O)c(C)c1CCC(O)=O
Show InChI InChI=1S/C18H19N3O5S/c1-9-12(4-6-17(22)23)10(2)20-16(9)8-14-13-7-11(27(19,25)26)3-5-15(13)21-18(14)24/h3,5,7-8,20H,4,6H2,1-2H3,(H,21,24)(H,22,23)(H2,19,25,26)/b14-8-
NCI pathway
Reactome pathway
n/an/a 280n/an/an/an/an/an/a
SUGEN, Inc.
Assay Description
The assays were performed in 96-well microtiter plates that had been coated with a polyGluTyr peptide. Negative control wells received buffer alone w...
J Med Chem 42: 5120-30 (1999)
Article DOI: 10.1021/jm9904295
BindingDB Entry DOI: 10.7270/Q20Z71GM