null
SMILES: O=c1[nH]c2cc3OCCOc3cc2cc1C(N1CCSCC1)c1nnnn1C1CCCC1
InChI Key: InChIKey=NHFBYJHPVMSGDX-UHFFFAOYSA-N
Activity Spreadsheet -- Enzyme Inhibition Constant Data from BindingDB
Found 4 hits for monomerid = 48988
Trg + Lig
Ki
nM
ΔG°
kcal/mole
IC50
nM
Kd
nM
EC50/IC50
nM
koff
s-1
kon
M-1s-1
pHTemp
°C
D(1A) dopamine receptor
(Homo sapiens (Human))
BDBM48988
(8-[(1-Cyclopentyl-1H-tetrazol-5-yl)-thiomorpholin-...)
Show SMILES O=c1[nH]c2cc3OCCOc3cc2cc1C(N1CCSCC1)c1nnnn1C1CCCC1
Show InChI InChI=1S/C22H26N6O3S/c29-22-16(11-14-12-18-19(13-17(14)23-22)31-8-7-30-18)20(27-5-9-32-10-6-27)21-24-25-26-28(21)15-3-1-2-4-15/h11-13,15,20H,1-10H2,(H,23,29)
PCBioAssay
n/an/an/an/a 0.0238n/an/an/an/a
Vanderbilt Screening Center for GPCRs, Ion Channels and Transporters
Curated by PubChem BioAssay
Assay Description
Assay Provider: Val Watts Assay Provider Affiliation: Purdue University Grant Title: Allosteric Modulators of D1 Receptors Grant Number: 1 X01 MH0776...
PubChem Bioassay (2007)
BindingDB Entry DOI: 10.7270/Q2H41PVH
Envelope glycoprotein gp160
(Human immunodeficiency virus type 1 group M subtyp...)
BDBM48988
(8-[(1-Cyclopentyl-1H-tetrazol-5-yl)-thiomorpholin-...)
Show SMILES O=c1[nH]c2cc3OCCOc3cc2cc1C(N1CCSCC1)c1nnnn1C1CCCC1
Show InChI InChI=1S/C22H26N6O3S/c29-22-16(11-14-12-18-19(13-17(14)23-22)31-8-7-30-18)20(27-5-9-32-10-6-27)21-24-25-26-28(21)15-3-1-2-4-15/h11-13,15,20H,1-10H2,(H,23,29)
PCBioAssay
n/an/a 7.79E+3n/an/an/an/an/an/a
The Scripps Research Institute Molecular Screening Center
Curated by PubChem BioAssay
PubChem Bioassay (2012)
BindingDB Entry DOI: 10.7270/Q29W0D3P
Envelope glycoprotein gp160
(Human immunodeficiency virus type 1 group M subtyp...)
BDBM48988
(8-[(1-Cyclopentyl-1H-tetrazol-5-yl)-thiomorpholin-...)
Show SMILES O=c1[nH]c2cc3OCCOc3cc2cc1C(N1CCSCC1)c1nnnn1C1CCCC1
Show InChI InChI=1S/C22H26N6O3S/c29-22-16(11-14-12-18-19(13-17(14)23-22)31-8-7-30-18)20(27-5-9-32-10-6-27)21-24-25-26-28(21)15-3-1-2-4-15/h11-13,15,20H,1-10H2,(H,23,29)
PCBioAssay
n/an/a 7.99E+3n/an/an/an/an/an/a
The Scripps Research Institute Molecular Screening Center
Curated by PubChem BioAssay
PubChem Bioassay (2012)
BindingDB Entry DOI: 10.7270/Q2FN14T0
Envelope glycoprotein gp160
(Human immunodeficiency virus type 1 group M subtyp...)
BDBM48988
(8-[(1-Cyclopentyl-1H-tetrazol-5-yl)-thiomorpholin-...)
Show SMILES O=c1[nH]c2cc3OCCOc3cc2cc1C(N1CCSCC1)c1nnnn1C1CCCC1
Show InChI InChI=1S/C22H26N6O3S/c29-22-16(11-14-12-18-19(13-17(14)23-22)31-8-7-30-18)20(27-5-9-32-10-6-27)21-24-25-26-28(21)15-3-1-2-4-15/h11-13,15,20H,1-10H2,(H,23,29)
PCBioAssay
n/an/a 1.63E+4n/an/an/an/an/an/a
The Scripps Research Institute Molecular Screening Center
Curated by PubChem BioAssay
PubChem Bioassay (2012)
BindingDB Entry DOI: 10.7270/Q2KD1WJB