BDBM4904 (3Z)-3-(4,5,6,7-tetrahydro-1H-indol-2-ylmethylidene)-2,3-dihydro-1H-indol-2-one::3-(4,5,6,7-Tetrahydro-1H-indol-2-ylmethylene)-1,3-dihydroindol-2-one::Indolin-2-one deriv. 4a
SMILES: O=C1Nc2ccccc2\C1=C\c1cc2CCCCc2[nH]1
InChI Key: InChIKey=PEQAQVCHUDMZPB-UVTDQMKNSA-N
Data: 5 IC50
Activity Spreadsheet -- Enzyme Inhibition Constant Data from BindingDB
Found 5 hits for monomerid = 4904
Trg + Lig
Ki
nM
ΔG°
kcal/mole
IC50
nM
Kd
nM
EC50/IC50
nM
koff
s-1
kon
M-1s-1
pHTemp
°C
Vascular endothelial growth factor receptor 2
(Homo sapiens (Human))
BDBM4904
((3Z)-3-(4,5,6,7-tetrahydro-1H-indol-2-ylmethyliden...)
Show SMILES O=C1Nc2ccccc2\C1=C\c1cc2CCCCc2[nH]1
Show InChI InChI=1S/C17H16N2O/c20-17-14(13-6-2-4-8-16(13)19-17)10-12-9-11-5-1-3-7-15(11)18-12/h2,4,6,8-10,18H,1,3,5,7H2,(H,19,20)/b14-10-
NCI pathway
Reactome pathway
n/an/a 480n/an/an/an/a7.522
SUGEN, Inc.
Assay Description
The assays were performed in 96-well microtiter plates that had been coated with a polyGluTyr peptide. Negative control wells received buffer alone w...
J Med Chem 43: 2655-63 (2000)
Article DOI: 10.1021/jm9906116
BindingDB Entry DOI: 10.7270/Q2W66J0N
Fibroblast growth factor receptor 1
(Homo sapiens (Human))
BDBM4904
((3Z)-3-(4,5,6,7-tetrahydro-1H-indol-2-ylmethyliden...)
Show SMILES O=C1Nc2ccccc2\C1=C\c1cc2CCCCc2[nH]1
Show InChI InChI=1S/C17H16N2O/c20-17-14(13-6-2-4-8-16(13)19-17)10-12-9-11-5-1-3-7-15(11)18-12/h2,4,6,8-10,18H,1,3,5,7H2,(H,19,20)/b14-10-
NCI pathway
Reactome pathway
n/an/a 1.05E+4n/an/an/an/an/an/a
SUGEN, Inc.
Assay Description
The assays were performed in 96-well microtiter plates that had been coated with a polyGluTyr peptide. Negative control wells received buffer alone w...
J Med Chem 43: 2655-63 (2000)
Article DOI: 10.1021/jm9906116
BindingDB Entry DOI: 10.7270/Q2W66J0N
Epidermal growth factor receptor
(Homo sapiens (Human))
BDBM4904
((3Z)-3-(4,5,6,7-tetrahydro-1H-indol-2-ylmethyliden...)
Show SMILES O=C1Nc2ccccc2\C1=C\c1cc2CCCCc2[nH]1
Show InChI InChI=1S/C17H16N2O/c20-17-14(13-6-2-4-8-16(13)19-17)10-12-9-11-5-1-3-7-15(11)18-12/h2,4,6,8-10,18H,1,3,5,7H2,(H,19,20)/b14-10-
n/an/a>1.00E+5n/an/an/an/an/an/a
SUGEN, Inc.
Assay Description
IC50 is the inhibitor concentration which inhibits 50% of EGF-R or PDGFR-beta kinase autophosphorylation activity. The assay was performed in 96-well...
J Med Chem 43: 2655-63 (2000)
Article DOI: 10.1021/jm9906116
BindingDB Entry DOI: 10.7270/Q2W66J0N
Platelet-derived growth factor receptor beta
(Homo sapiens (Human))
BDBM4904
((3Z)-3-(4,5,6,7-tetrahydro-1H-indol-2-ylmethyliden...)
Show SMILES O=C1Nc2ccccc2\C1=C\c1cc2CCCCc2[nH]1
Show InChI InChI=1S/C17H16N2O/c20-17-14(13-6-2-4-8-16(13)19-17)10-12-9-11-5-1-3-7-15(11)18-12/h2,4,6,8-10,18H,1,3,5,7H2,(H,19,20)/b14-10-
NCI pathway
Reactome pathway
n/an/a 5.46E+3n/an/an/an/an/an/a
SUGEN, Inc.
Assay Description
IC50 is the inhibitor concentration which inhibits 50% of EGF-R or PDGFR-beta kinase autophosphorylation activity. The assay was performed in 96-well...
J Med Chem 43: 2655-63 (2000)
Article DOI: 10.1021/jm9906116
BindingDB Entry DOI: 10.7270/Q2W66J0N
Proto-oncogene tyrosine-protein kinase Src
(Homo sapiens (Human))
BDBM4904
((3Z)-3-(4,5,6,7-tetrahydro-1H-indol-2-ylmethyliden...)
Show SMILES O=C1Nc2ccccc2\C1=C\c1cc2CCCCc2[nH]1
Show InChI InChI=1S/C17H16N2O/c20-17-14(13-6-2-4-8-16(13)19-17)10-12-9-11-5-1-3-7-15(11)18-12/h2,4,6,8-10,18H,1,3,5,7H2,(H,19,20)/b14-10-
n/an/a 4.74E+3n/an/an/an/an/an/a
SUGEN, Inc.
Assay Description
The assays were performed in 96-well microtiter plates that had been coated with a polyGluTyr peptide. Negative control wells received buffer alone w...
J Med Chem 43: 2655-63 (2000)
Article DOI: 10.1021/jm9906116
BindingDB Entry DOI: 10.7270/Q2W66J0N