null
SMILES: CN1CCN(Cc2cc(COCc3ccccc3)c3cccnc3c2O)CC1
InChI Key: InChIKey=VYDKIYBONPPDRB-UHFFFAOYSA-N
Activity Spreadsheet -- Enzyme Inhibition Constant Data from BindingDB
Found 2 hits for monomerid = 49239
Trg + Lig
Ki
nM
ΔG°
kcal/mole
IC50
nM
Kd
nM
EC50/IC50
nM
koff
s-1
kon
M-1s-1
pHTemp
°C
ATP-dependent molecular chaperone HSP82
(Candida albicans)
BDBM49239
(5-(benzoxymethyl)-7-[(4-methylpiperazino)methyl]qu...)
Show SMILES CN1CCN(Cc2cc(COCc3ccccc3)c3cccnc3c2O)CC1
Show InChI InChI=1S/C23H27N3O2/c1-25-10-12-26(13-11-25)15-19-14-20(17-28-16-18-6-3-2-4-7-18)21-8-5-9-24-22(21)23(19)27/h2-9,14,27H,10-13,15-17H2,1H3
PCBioAssay
n/an/an/an/a 1.46E+3n/an/an/an/a
Broad Institute
Curated by PubChem BioAssay
Assay Description
Broad Institute: Reversing Antifungal Drug Resistance Project ID: 2037 Keywords: Candida albicans, drug resistance, Fluconazole, Hsp90, Calcineurin, ...
PubChem Bioassay (2010)
BindingDB Entry DOI: 10.7270/Q26M358G
Transcription factor p65
(Homo sapiens (Human))
BDBM49239
(5-(benzoxymethyl)-7-[(4-methylpiperazino)methyl]qu...)
Show SMILES CN1CCN(Cc2cc(COCc3ccccc3)c3cccnc3c2O)CC1
Show InChI InChI=1S/C23H27N3O2/c1-25-10-12-26(13-11-25)15-19-14-20(17-28-16-18-6-3-2-4-7-18)21-8-5-9-24-22(21)23(19)27/h2-9,14,27H,10-13,15-17H2,1H3
PCBioAssay
n/an/an/an/a 1.10E+4n/an/an/an/a
SRMLSC
Curated by PubChem BioAssay
Assay Description
Southern Research Molecular Libraries Screening Center (SRMLSC) Southern Research Institute (Birmingham, Alabama) NIH Molecular Libraries Screening C...
PubChem Bioassay (2008)
BindingDB Entry DOI: 10.7270/Q27P8WT7