BDBM4942 (2R,3R,4S)-4-carbamimidamido-2-(diethylcarbamoyl)-3-acetamido-3,4-dihydro-2H-pyran-6-carboxylic acid::carboxamide deriv. 5j
SMILES: [H][C@]1([#8]-[#6](=[#6]-[#6@H](\[#7]=[#6](/[#7])-[#7])-[#6@H]1-[#7]-[#6](-[#6])=O)-[#6](-[#8])=O)[#6](=O)-[#7](-[#6]-[#6])-[#6]-[#6]
InChI Key: InChIKey=UQCJWKCRQHMDOW-JMJZKYOTSA-N
Data: 4 IC50
PDB links: 2 PDB IDs contain inhibitors having a similarity of 90% to this monomer.
Activity Spreadsheet -- Enzyme Inhibition Constant Data from BindingDB
Found 4 hits for monomerid = 4942
Trg + Lig
Ki
nM
ΔG°
kcal/mole
IC50
nM
Kd
nM
EC50/IC50
nM
koff
s-1
kon
M-1s-1
pHTemp
°C
Neuraminidase A
(Influenza A virus (A/Singapore/1/57(H2N2)))
BDBM4942
((2R,3R,4S)-4-carbamimidamido-2-(diethylcarbamoyl)-...)
Show SMILES [H][C@]1([#8]-[#6](=[#6]-[#6@H](\[#7]=[#6](/[#7])-[#7])-[#6@H]1-[#7]-[#6](-[#6])=O)-[#6](-[#8])=O)[#6](=O)-[#7](-[#6]-[#6])-[#6]-[#6] |r,c:3|
Show InChI InChI=1S/C14H23N5O5/c1-4-19(5-2)12(21)11-10(17-7(3)20)8(18-14(15)16)6-9(24-11)13(22)23/h6,8,10-11H,4-5H2,1-3H3,(H,17,20)(H,22,23)(H4,15,16,18)/t8-,10+,11+/m0/s1
n/an/a 1n/an/an/an/an/an/a
Glaxo Wellcome Research and Development Limited
Assay Description
A standard fluorimetric assay was used to measure influenza virus neuraminidase activity. The substrate 2 -(4-methylumbelliferyl)-alpha-D-acetylneura...
J Med Chem 41: 787-97 (1998)
Article DOI: 10.1021/jm970374b
BindingDB Entry DOI: 10.7270/Q2RF5S7G
Neuraminidase A
(Influenza A virus (A/Puerto Rico/8/34/Mount Sinai(...)
BDBM4942
((2R,3R,4S)-4-carbamimidamido-2-(diethylcarbamoyl)-...)
Show SMILES [H][C@]1([#8]-[#6](=[#6]-[#6@H](\[#7]=[#6](/[#7])-[#7])-[#6@H]1-[#7]-[#6](-[#6])=O)-[#6](-[#8])=O)[#6](=O)-[#7](-[#6]-[#6])-[#6]-[#6] |r,c:3|
Show InChI InChI=1S/C14H23N5O5/c1-4-19(5-2)12(21)11-10(17-7(3)20)8(18-14(15)16)6-9(24-11)13(22)23/h6,8,10-11H,4-5H2,1-3H3,(H,17,20)(H,22,23)(H4,15,16,18)/t8-,10+,11+/m0/s1
n/an/a 1n/an/an/an/an/an/a
TBA
Curated by ChEMBL
Assay Description
Inhibition of influenza A sialidase (neuraminidase)
Bioorg Med Chem Lett 6: 2931-2936 (1996)
Article DOI: 10.1016/S0960-894X(96)00542-2
BindingDB Entry DOI: 10.7270/Q24B31TM
Neuraminidase B
(Influenza B virus (B/Lee/40))
BDBM4942
((2R,3R,4S)-4-carbamimidamido-2-(diethylcarbamoyl)-...)
Show SMILES [H][C@]1([#8]-[#6](=[#6]-[#6@H](\[#7]=[#6](/[#7])-[#7])-[#6@H]1-[#7]-[#6](-[#6])=O)-[#6](-[#8])=O)[#6](=O)-[#7](-[#6]-[#6])-[#6]-[#6] |r,c:3|
Show InChI InChI=1S/C14H23N5O5/c1-4-19(5-2)12(21)11-10(17-7(3)20)8(18-14(15)16)6-9(24-11)13(22)23/h6,8,10-11H,4-5H2,1-3H3,(H,17,20)(H,22,23)(H4,15,16,18)/t8-,10+,11+/m0/s1
n/an/a 500n/an/an/an/an/an/a
TBA
Curated by ChEMBL
Assay Description
Inhibition of influenza B sialidase (neuraminidase)
Bioorg Med Chem Lett 6: 2931-2936 (1996)
Article DOI: 10.1016/S0960-894X(96)00542-2
BindingDB Entry DOI: 10.7270/Q24B31TM
Neuraminidase B
(Influenza B virus)
BDBM4942
((2R,3R,4S)-4-carbamimidamido-2-(diethylcarbamoyl)-...)
Show SMILES [H][C@]1([#8]-[#6](=[#6]-[#6@H](\[#7]=[#6](/[#7])-[#7])-[#6@H]1-[#7]-[#6](-[#6])=O)-[#6](-[#8])=O)[#6](=O)-[#7](-[#6]-[#6])-[#6]-[#6] |r,c:3|
Show InChI InChI=1S/C14H23N5O5/c1-4-19(5-2)12(21)11-10(17-7(3)20)8(18-14(15)16)6-9(24-11)13(22)23/h6,8,10-11H,4-5H2,1-3H3,(H,17,20)(H,22,23)(H4,15,16,18)/t8-,10+,11+/m0/s1
n/an/a 490n/an/an/an/an/an/a
Glaxo Wellcome Research and Development Limited
Assay Description
A standard fluorimetric assay was used to measure influenza virus neuraminidase activity. The substrate 2 -(4-methylumbelliferyl)-alpha-D-acetylneura...
J Med Chem 41: 787-97 (1998)
Article DOI: 10.1021/jm970374b
BindingDB Entry DOI: 10.7270/Q2RF5S7G