null
SMILES: COc1cc(cc(OC)c1OC)C(=O)NC1OC(C(O)C(O)C1O)C(O)=O
InChI Key: InChIKey=ZQSHPWNKSZDOEK-UHFFFAOYSA-N
Activity Spreadsheet -- Enzyme Inhibition Constant Data from BindingDB
Found 1 hit for monomerid = 50000128
Trg + Lig
Ki
nM
ΔG°
kcal/mole
IC50
nM
Kd
nM
EC50/IC50
nM
koff
s-1
kon
M-1s-1
pHTemp
°C
Fibroblast growth factor 2
(Homo sapiens (Human))
BDBM50000128
(CHEMBL113091)
Show SMILES COc1cc(cc(OC)c1OC)C(=O)NC1OC(C(O)C(O)C1O)C(O)=O
Show InChI InChI=1S/C16H21NO10/c1-24-7-4-6(5-8(25-2)12(7)26-3)14(21)17-15-11(20)9(18)10(19)13(27-15)16(22)23/h4-5,9-11,13,15,18-20H,1-3H3,(H,17,21)(H,22,23)
Reactome pathway
n/an/a 58n/an/an/an/an/an/a
University College Dublin
Curated by ChEMBL
Assay Description
23% inhibition of FGF-2 binding to heparin-albumin by ELISA
Bioorg Med Chem Lett 12: 3287-90 (2002)
BindingDB Entry DOI: 10.7270/Q2ZP45G2