BDBM50000138 CHEMBL384014::Ribonucleotide reductase inhibiting peptide analogue
SMILES: CC[C@@H](C)[C@H](NC(=O)[C@@H](NC(=O)[C@@H](NC(=O)CNC(=O)[C@H](C)NC(=O)[C@H](Cc1ccc(O)cc1)N(C)C(C)=O)[C@@H](C)O)C(C)C)C(=O)N[C@@H](CC(N)=O)C(=O)N[C@@H](CC(O)=O)C(=O)N[C@@H](CC(C)C)C(O)=O
InChI Key: InChIKey=REVYZAOSTIOZSY-ZMSDPHGOSA-N
Data: 1 IC50
Activity Spreadsheet -- Enzyme Inhibition Constant Data from BindingDB
Found 1 hit for monomerid = 50000138
Trg + Lig
Ki
nM
ΔG°
kcal/mole
IC50
nM
Kd
nM
EC50/IC50
nM
koff
s-1
kon
M-1s-1
pHTemp
°C
Ribonucleoside-diphosphate reductase large subunit
(Homo sapiens (Human))
BDBM50000138
(CHEMBL384014 | Ribonucleotide reductase inhibiting...)
Show SMILES CC[C@@H](C)[C@H](NC(=O)[C@@H](NC(=O)[C@@H](NC(=O)CNC(=O)[C@H](C)NC(=O)[C@H](Cc1ccc(O)cc1)N(C)C(C)=O)[C@@H](C)O)C(C)C)C(=O)N[C@@H](CC(N)=O)C(=O)N[C@@H](CC(O)=O)C(=O)N[C@@H](CC(C)C)C(O)=O
Show InChI InChI=1S/C46H72N10O16/c1-11-23(6)37(44(69)51-29(18-33(47)60)40(65)50-30(19-35(62)63)41(66)52-31(46(71)72)16-21(2)3)55-43(68)36(22(4)5)54-45(70)38(25(8)57)53-34(61)20-48-39(64)24(7)49-42(67)32(56(10)26(9)58)17-27-12-14-28(59)15-13-27/h12-15,21-25,29-32,36-38,57,59H,11,16-20H2,1-10H3,(H2,47,60)(H,48,64)(H,49,67)(H,50,65)(H,51,69)(H,52,66)(H,53,61)(H,54,70)(H,55,68)(H,62,63)(H,71,72)/t23-,24+,25-,29+,30+,31+,32+,36+,37+,38+/m1/s1
NCI pathway
Reactome pathway
n/an/a 1.21E+4n/an/an/an/an/an/a
Notre-Dame Hospital Research
Curated by ChEMBL
Assay Description
Inhibitory concentration against HSV-1 ribonucleotide reductase R1 protein binding
J Med Chem 35: 346-50 (1992)
BindingDB Entry DOI: 10.7270/Q2348JB2