BDBM50000287 2-(3,4-Dichloro-phenyl)-1-(2-pyrrolidin-1-ylmethyl-piperidin-1-yl)-ethanone::2-(3,4-Dichloro-phenyl)-1-(2-pyrrolidin-1-ylmethyl-piperidin-1-yl)-ethanone(HCl)::CHEMBL128444
SMILES: Clc1ccc(CC(=O)N2CCCCC2CN2CCCC2)cc1Cl
InChI Key: InChIKey=GHCCBWMZKJQGLS-UHFFFAOYSA-N
Data: 3 KI  1 IC50
Activity Spreadsheet -- Enzyme Inhibition Constant Data from BindingDB
Found 4 hits for monomerid = 50000287
Trg + Lig
Ki
nM
ΔG°
kcal/mole
IC50
nM
Kd
nM
EC50/IC50
nM
koff
s-1
kon
M-1s-1
pHTemp
°C
Kappa-type opioid receptor
(Cavia porcellus (domestic guinea pig))
BDBM50000287
(2-(3,4-Dichloro-phenyl)-1-(2-pyrrolidin-1-ylmethyl...)
Show SMILES Clc1ccc(CC(=O)N2CCCCC2CN2CCCC2)cc1Cl
Show InChI InChI=1S/C18H24Cl2N2O/c19-16-7-6-14(11-17(16)20)12-18(23)22-10-2-1-5-15(22)13-21-8-3-4-9-21/h6-7,11,15H,1-5,8-10,12-13H2
0.530n/an/an/an/an/an/an/an/a
Zambeletti Research Laboratories
Curated by ChEMBL
Assay Description
Compound was evaluated for its binding affinity against Opioid receptor kappa 1 subtype in guinea pig brain (minus cerebellum) .using [3H]-U-69,593 a...
J Med Chem 34: 397-403 (1991)
BindingDB Entry DOI: 10.7270/Q23777N1
Mu-type opioid receptor
(GUINEA PIG)
BDBM50000287
(2-(3,4-Dichloro-phenyl)-1-(2-pyrrolidin-1-ylmethyl...)
Show SMILES Clc1ccc(CC(=O)N2CCCCC2CN2CCCC2)cc1Cl
Show InChI InChI=1S/C18H24Cl2N2O/c19-16-7-6-14(11-17(16)20)12-18(23)22-10-2-1-5-15(22)13-21-8-3-4-9-21/h6-7,11,15H,1-5,8-10,12-13H2
1.86E+3n/an/an/an/an/an/an/an/a
Zambeletti Research Laboratories
Curated by ChEMBL
Assay Description
Compound was evaluated for its binding affinity against Opioid receptor mu 1 subtype in guinea pig brain (minus cerebellum) using [3H]-DAGO as radiol...
J Med Chem 34: 397-403 (1991)
BindingDB Entry DOI: 10.7270/Q23777N1
Delta-type opioid receptor
(Homo sapiens (Human))
BDBM50000287
(2-(3,4-Dichloro-phenyl)-1-(2-pyrrolidin-1-ylmethyl...)
Show SMILES Clc1ccc(CC(=O)N2CCCCC2CN2CCCC2)cc1Cl
Show InChI InChI=1S/C18H24Cl2N2O/c19-16-7-6-14(11-17(16)20)12-18(23)22-10-2-1-5-15(22)13-21-8-3-4-9-21/h6-7,11,15H,1-5,8-10,12-13H2
Reactome pathway
>1.00E+4n/an/an/an/an/an/an/an/a
Zambeletti Research Laboratories
Curated by ChEMBL
Assay Description
Compound was evaluated for its binding affinity against Opioid receptor delta 1 subtype in guinea pig brain (minus cerebellum)using [3H]-DADLE as rad...
J Med Chem 34: 397-403 (1991)
BindingDB Entry DOI: 10.7270/Q23777N1
Kappa-type opioid receptor
(Homo sapiens (Human))
BDBM50000287
(2-(3,4-Dichloro-phenyl)-1-(2-pyrrolidin-1-ylmethyl...)
Show SMILES Clc1ccc(CC(=O)N2CCCCC2CN2CCCC2)cc1Cl
Show InChI InChI=1S/C18H24Cl2N2O/c19-16-7-6-14(11-17(16)20)12-18(23)22-10-2-1-5-15(22)13-21-8-3-4-9-21/h6-7,11,15H,1-5,8-10,12-13H2
Reactome pathway
n/an/a 11n/an/an/an/an/an/a
Glaxo Group Research Ltd.
Curated by ChEMBL
Assay Description
Kappa-opioid receptor agonist potency of the compound was determined in vitro using rabbit vas deferens(LVD) preparation
J Med Chem 35: 490-501 (1992)
BindingDB Entry DOI: 10.7270/Q2TQ60GV