BDBM50000340 7-Bromo-1-(2-dimethylamino-ethyl)-6-methoxy-4-(4-methoxy-phenyl)-3-methyl-1,3,4,5-tetrahydro-benzo[b]azepin-2-one::CHEMBL165086
SMILES: COc1ccc(cc1)[C@@H]1Cc2c(OC)c(Br)ccc2N(CCN(C)C)C(=O)[C@@H]1C
InChI Key: InChIKey=SWFLTIITSZOZAL-CRAIPNDOSA-N
Data: 1 Kd
Activity Spreadsheet -- Enzyme Inhibition Constant Data from BindingDB
Found 1 hit for monomerid = 50000340
Trg + Lig
Ki
nM
ΔG°
kcal/mole
IC50
nM
Kd
nM
EC50/IC50
nM
koff
s-1
kon
M-1s-1
pHTemp
°C
Voltage-gated L-type calcium channel
(Homo sapiens (Human))
BDBM50000340
(7-Bromo-1-(2-dimethylamino-ethyl)-6-methoxy-4-(4-m...)
Show SMILES COc1ccc(cc1)[C@@H]1Cc2c(OC)c(Br)ccc2N(CCN(C)C)C(=O)[C@@H]1C
Show InChI InChI=1S/C23H29BrN2O3/c1-15-18(16-6-8-17(28-4)9-7-16)14-19-21(11-10-20(24)22(19)29-5)26(23(15)27)13-12-25(2)3/h6-11,15,18H,12-14H2,1-5H3/t15-,18-/m1/s1
Reactome pathway
n/an/an/a 120n/an/an/an/an/a
Bristol-Myers Squibb Pharmaceutical Research Institute
Curated by ChEMBL
Assay Description
In vitro ability to displace the specific binding of [3H]-diltiazem to diltiazem receptor in guinea pig skeletal muscle.
J Med Chem 35: 780-93 (1992)
BindingDB Entry DOI: 10.7270/Q2K64H14