BDBM50000363 1-(2-Dimethylamino-ethyl)-3-methyl-4-(4-methylsulfanyl-phenyl)-6-trifluoromethyl-1,3,4,5-tetrahydro-benzo[b]azepin-2-one::CHEMBL167384
SMILES: CSc1ccc(cc1)[C@@H]1Cc2c(cccc2C(F)(F)F)N(CCN(C)C)C(=O)[C@@H]1C
InChI Key: InChIKey=HYBPGPKSOHJLGG-CRAIPNDOSA-N
Data: 1 Kd
Activity Spreadsheet -- Enzyme Inhibition Constant Data from BindingDB
Found 1 hit for monomerid = 50000363
Trg + Lig
Ki
nM
ΔG°
kcal/mole
IC50
nM
Kd
nM
EC50/IC50
nM
koff
s-1
kon
M-1s-1
pHTemp
°C
Voltage-gated L-type calcium channel
(Homo sapiens (Human))
BDBM50000363
(1-(2-Dimethylamino-ethyl)-3-methyl-4-(4-methylsulf...)
Show SMILES CSc1ccc(cc1)[C@@H]1Cc2c(cccc2C(F)(F)F)N(CCN(C)C)C(=O)[C@@H]1C
Show InChI InChI=1S/C23H27F3N2OS/c1-15-18(16-8-10-17(30-4)11-9-16)14-19-20(23(24,25)26)6-5-7-21(19)28(22(15)29)13-12-27(2)3/h5-11,15,18H,12-14H2,1-4H3/t15-,18-/m1/s1
Reactome pathway
n/an/an/a 1.10E+3n/an/an/an/an/a
Bristol-Myers Squibb Pharmaceutical Research Institute
Curated by ChEMBL
Assay Description
In vitro ability to displace the specific binding of [3H]-diltiazem to diltiazem receptor in guinea pig skeletal muscle.
J Med Chem 35: 780-93 (1992)
BindingDB Entry DOI: 10.7270/Q2K64H14