BDBM50000563 3-{2-[2-Acetylamino-3-(3H-imidazol-4-yl)-propionylamino]-4-methyl-pentanoylamino}-N-(1-{1-[1-carboxy-2-(1H-indol-3-yl)-ethylcarbamoyl]-2-methyl-butylcarbamoyl}-2-methyl-butyl)-succinamic acid::CHEMBL38071
SMILES: CC[C@H](C)[C@H](NC(=O)[C@H](CC(O)=O)NC(=O)[C@H](CC(C)C)NC(=O)[C@H](Cc1cnc[nH]1)NC(C)=O)C(=O)N[C@H]([C@@H](C)CC)C(=O)N[C@@H](Cc1c[nH]c2ccccc12)C(O)=O
InChI Key: InChIKey=NGCFKFBXSAWULW-FVTDBDTKSA-N
Data: 1 IC50
Activity Spreadsheet -- Enzyme Inhibition Constant Data from BindingDB
Found 1 hit for monomerid = 50000563
Trg + Lig
Ki
nM
ΔG°
kcal/mole
IC50
nM
Kd
nM
EC50/IC50
nM
koff
s-1
kon
M-1s-1
pHTemp
°C
EDNRA
(RAT)
BDBM50000563
(3-{2-[2-Acetylamino-3-(3H-imidazol-4-yl)-propionyl...)
Show SMILES CC[C@H](C)[C@H](NC(=O)[C@H](CC(O)=O)NC(=O)[C@H](CC(C)C)NC(=O)[C@H](Cc1cnc[nH]1)NC(C)=O)C(=O)N[C@H]([C@@H](C)CC)C(=O)N[C@@H](Cc1c[nH]c2ccccc12)C(O)=O
Show InChI InChI=1S/C41H59N9O10/c1-8-22(5)34(39(57)48-32(41(59)60)15-25-18-43-28-13-11-10-12-27(25)28)50-40(58)35(23(6)9-2)49-38(56)31(17-33(52)53)47-36(54)29(14-21(3)4)46-37(55)30(45-24(7)51)16-26-19-42-20-44-26/h10-13,18-23,29-32,34-35,43H,8-9,14-17H2,1-7H3,(H,42,44)(H,45,51)(H,46,55)(H,47,54)(H,48,57)(H,49,56)(H,50,58)(H,52,53)(H,59,60)/t22-,23-,29-,30-,31-,32-,34+,35-/m0/s1
Reactome pathway
n/an/a 1.30E+4n/an/an/an/an/an/a
Warner-Lambert Company
Curated by ChEMBL
Assay Description
Compound was evaluated for the binding affinity to endothelin receptor in the rat heart ventricle.
J Med Chem 35: 1493-508 (1992)
BindingDB Entry DOI: 10.7270/Q27M08KX