BDBM50000866 2-(Oxalyl-amino)-propionic acid (0.25H2O)::CHEMBL451545
SMILES: C[C@H](NC(=O)C(O)=O)C(O)=O
InChI Key: InChIKey=TZPZMVZGJVYAML-REOHCLBHSA-N
Data: 1 IC50
Activity Spreadsheet -- Enzyme Inhibition Constant Data from BindingDB
Found 1 hit for monomerid = 50000866
Trg + Lig
Ki
nM
ΔG°
kcal/mole
IC50
nM
Kd
nM
EC50/IC50
nM
koff
s-1
kon
M-1s-1
pHTemp
°C
Prolyl 4-hydroxylase alpha-1 subunit
(Rattus norvegicus)
BDBM50000866
(2-(Oxalyl-amino)-propionic acid (0.25H2O) | CHEMBL...)
Show SMILES C[C@H](NC(=O)C(O)=O)C(O)=O
Show InChI InChI=1S/C5H7NO5/c1-2(4(8)9)6-3(7)5(10)11/h2H,1H3,(H,6,7)(H,8,9)(H,10,11)/t2-/m0/s1
n/an/a 3.82E+4n/an/an/an/an/an/a
ICI Pharmaceuticals
Curated by ChEMBL
Assay Description
Compound was evaluated for the inhibition of prolyl 4-hydroxylase
J Med Chem 35: 2652-8 (1992)
BindingDB Entry DOI: 10.7270/Q28P5ZF9