BDBM50000879 7-[4-(1-Cyclohexyl-1H-tetrazol-5-yl)-butoxy]-1,3-dihydro-imidazo[4,5-b]quinolin-2-one(HCl)::CHEMBL89679
SMILES: O=c1[nH]c2cc3cc(OCCCCc4nnnn4C4CCCCC4)ccc3nc2[nH]1
InChI Key: InChIKey=JAODEWCDRHAJPF-UHFFFAOYSA-N
Data: 2 IC50  1 EC50
Activity Spreadsheet -- Enzyme Inhibition Constant Data from BindingDB
Found 3 hits for monomerid = 50000879
Trg + Lig
Ki
nM
ΔG°
kcal/mole
IC50
nM
Kd
nM
EC50/IC50
nM
koff
s-1
kon
M-1s-1
pHTemp
°C
Purinergic receptor P2Y12
(Homo sapiens (Human))
BDBM50000879
(7-[4-(1-Cyclohexyl-1H-tetrazol-5-yl)-butoxy]-1,3-d...)
Show SMILES O=c1[nH]c2cc3cc(OCCCCc4nnnn4C4CCCCC4)ccc3nc2[nH]1
Show InChI InChI=1S/C21H25N7O2/c29-21-23-18-13-14-12-16(9-10-17(14)22-20(18)24-21)30-11-5-4-8-19-25-26-27-28(19)15-6-2-1-3-7-15/h9-10,12-13,15H,1-8,11H2,(H2,22,23,24,29)
Reactome pathway
n/an/an/an/a 250n/an/an/an/a
Bristol-Myers Squibb Pharmaceutical Research Institute
Curated by ChEMBL
Assay Description
Inhibition of platelet aggregation using Adenosine diphosphate (ADP) as activating agent in rabbit platelet rich plasma (PRP)
J Med Chem 35: 2672-87 (1992)
BindingDB Entry DOI: 10.7270/Q2513X52
Phosphodiesterase 3
(Homo sapiens (Human))
BDBM50000879
(7-[4-(1-Cyclohexyl-1H-tetrazol-5-yl)-butoxy]-1,3-d...)
Show SMILES O=c1[nH]c2cc3cc(OCCCCc4nnnn4C4CCCCC4)ccc3nc2[nH]1
Show InChI InChI=1S/C21H25N7O2/c29-21-23-18-13-14-12-16(9-10-17(14)22-20(18)24-21)30-11-5-4-8-19-25-26-27-28(19)15-6-2-1-3-7-15/h9-10,12-13,15H,1-8,11H2,(H2,22,23,24,29)
n/an/a 4n/an/an/an/an/an/a
Bristol-Myers Squibb Pharmaceutical Research Institute
Curated by ChEMBL
Assay Description
Inhibition of human platelet PDE by inhibiting cyclic Adenosine monophosphate (cAMP) hydrolysis
J Med Chem 35: 2672-87 (1992)
BindingDB Entry DOI: 10.7270/Q2513X52
Homo sapiens phosphodiesterase 2A (PDE2A)
(Homo sapiens (Human))
BDBM50000879
(7-[4-(1-Cyclohexyl-1H-tetrazol-5-yl)-butoxy]-1,3-d...)
Show SMILES O=c1[nH]c2cc3cc(OCCCCc4nnnn4C4CCCCC4)ccc3nc2[nH]1
Show InChI InChI=1S/C21H25N7O2/c29-21-23-18-13-14-12-16(9-10-17(14)22-20(18)24-21)30-11-5-4-8-19-25-26-27-28(19)15-6-2-1-3-7-15/h9-10,12-13,15H,1-8,11H2,(H2,22,23,24,29)
n/an/a>1.00E+5n/an/an/an/an/an/a
Bristol-Myers Squibb Pharmaceutical Research Institute
Curated by ChEMBL
Assay Description
Inhibition of human platelet PDE by inhibiting cyclic Guanosine monophosphate (cGMP) hydrolysis
J Med Chem 35: 2672-87 (1992)
BindingDB Entry DOI: 10.7270/Q2513X52