BDBM50000906 7-(4-Morpholin-4-yl-4-oxo-butoxy)-1,3-dihydro-imidazo[4,5-b]quinolin-2-one::CHEMBL89660
SMILES: O=C(CCCOc1ccc2nc3[nH]c(=O)[nH]c3cc2c1)N1CCOCC1
InChI Key: InChIKey=AXOWWPSGJNHDFB-UHFFFAOYSA-N
Data: 2 IC50  1 EC50
Activity Spreadsheet -- Enzyme Inhibition Constant Data from BindingDB
Found 3 hits for monomerid = 50000906
Trg + Lig
Ki
nM
ΔG°
kcal/mole
IC50
nM
Kd
nM
EC50/IC50
nM
koff
s-1
kon
M-1s-1
pHTemp
°C
Homo sapiens phosphodiesterase 2A (PDE2A)
(Homo sapiens (Human))
BDBM50000906
(7-(4-Morpholin-4-yl-4-oxo-butoxy)-1,3-dihydro-imid...)
Show SMILES O=C(CCCOc1ccc2nc3[nH]c(=O)[nH]c3cc2c1)N1CCOCC1
Show InChI InChI=1S/C18H20N4O4/c23-16(22-5-8-25-9-6-22)2-1-7-26-13-3-4-14-12(10-13)11-15-17(19-14)21-18(24)20-15/h3-4,10-11H,1-2,5-9H2,(H2,19,20,21,24)
n/an/a 4.00E+4n/an/an/an/an/an/a
Bristol-Myers Squibb Pharmaceutical Research Institute
Curated by ChEMBL
Assay Description
Inhibition of human platelet PDE by inhibiting cyclic Guanosine monophosphate (cGMP) hydrolysis
J Med Chem 35: 2672-87 (1992)
BindingDB Entry DOI: 10.7270/Q2513X52
Phosphodiesterase 3
(Homo sapiens (Human))
BDBM50000906
(7-(4-Morpholin-4-yl-4-oxo-butoxy)-1,3-dihydro-imid...)
Show SMILES O=C(CCCOc1ccc2nc3[nH]c(=O)[nH]c3cc2c1)N1CCOCC1
Show InChI InChI=1S/C18H20N4O4/c23-16(22-5-8-25-9-6-22)2-1-7-26-13-3-4-14-12(10-13)11-15-17(19-14)21-18(24)20-15/h3-4,10-11H,1-2,5-9H2,(H2,19,20,21,24)
n/an/a 40n/an/an/an/an/an/a
Bristol-Myers Squibb Pharmaceutical Research Institute
Curated by ChEMBL
Assay Description
Inhibition of human platelet PDE by inhibiting cyclic Adenosine monophosphate (cAMP) hydrolysis
J Med Chem 35: 2672-87 (1992)
BindingDB Entry DOI: 10.7270/Q2513X52
Purinergic receptor P2Y12
(Homo sapiens (Human))
BDBM50000906
(7-(4-Morpholin-4-yl-4-oxo-butoxy)-1,3-dihydro-imid...)
Show SMILES O=C(CCCOc1ccc2nc3[nH]c(=O)[nH]c3cc2c1)N1CCOCC1
Show InChI InChI=1S/C18H20N4O4/c23-16(22-5-8-25-9-6-22)2-1-7-26-13-3-4-14-12(10-13)11-15-17(19-14)21-18(24)20-15/h3-4,10-11H,1-2,5-9H2,(H2,19,20,21,24)
Reactome pathway
n/an/an/an/a 280n/an/an/an/a
Bristol-Myers Squibb Pharmaceutical Research Institute
Curated by ChEMBL
Assay Description
Inhibition of platelet aggregation using Adenosine diphosphate (ADP) as activating agent in rabbit platelet rich plasma (PRP)
J Med Chem 35: 2672-87 (1992)
BindingDB Entry DOI: 10.7270/Q2513X52