BDBM50000908 CHEMBL92363::N-Cyclohexyl-N-methyl-4-(1-methyl-2-oxo-2,3-dihydro-1H-imidazo[4,5-b]quinolin-7-yloxy)-butyramide
SMILES: CN(C1CCCCC1)C(=O)CCCOc1ccc2nc3[nH]c(=O)n(C)c3cc2c1
InChI Key: InChIKey=ICAYDZWGWKWMMB-UHFFFAOYSA-N
Data: 2 IC50  1 EC50
Activity Spreadsheet -- Enzyme Inhibition Constant Data from BindingDB
Found 3 hits for monomerid = 50000908
Trg + Lig
Ki
nM
ΔG°
kcal/mole
IC50
nM
Kd
nM
EC50/IC50
nM
koff
s-1
kon
M-1s-1
pHTemp
°C
Phosphodiesterase 3
(Homo sapiens (Human))
BDBM50000908
(CHEMBL92363 | N-Cyclohexyl-N-methyl-4-(1-methyl-2-...)
Show SMILES CN(C1CCCCC1)C(=O)CCCOc1ccc2nc3[nH]c(=O)n(C)c3cc2c1
Show InChI InChI=1S/C22H28N4O3/c1-25(16-7-4-3-5-8-16)20(27)9-6-12-29-17-10-11-18-15(13-17)14-19-21(23-18)24-22(28)26(19)2/h10-11,13-14,16H,3-9,12H2,1-2H3,(H,23,24,28)
n/an/a 200n/an/an/an/an/an/a
Bristol-Myers Squibb Pharmaceutical Research Institute
Curated by ChEMBL
Assay Description
Inhibition of platelet aggregation using adenosine diphosphate (ADP) as activating agent in human platelet rich plasma (PRP)
J Med Chem 35: 2672-87 (1992)
BindingDB Entry DOI: 10.7270/Q2513X52
Purinergic receptor P2Y12
(Homo sapiens (Human))
BDBM50000908
(CHEMBL92363 | N-Cyclohexyl-N-methyl-4-(1-methyl-2-...)
Show SMILES CN(C1CCCCC1)C(=O)CCCOc1ccc2nc3[nH]c(=O)n(C)c3cc2c1
Show InChI InChI=1S/C22H28N4O3/c1-25(16-7-4-3-5-8-16)20(27)9-6-12-29-17-10-11-18-15(13-17)14-19-21(23-18)24-22(28)26(19)2/h10-11,13-14,16H,3-9,12H2,1-2H3,(H,23,24,28)
Reactome pathway
n/an/an/an/a 50n/an/an/an/a
Bristol-Myers Squibb Pharmaceutical Research Institute
Curated by ChEMBL
Assay Description
Inhibition of platelet aggregation using Adenosine diphosphate (ADP) as activating agent in rabbit platelet rich plasma (PRP)
J Med Chem 35: 2672-87 (1992)
BindingDB Entry DOI: 10.7270/Q2513X52
Homo sapiens phosphodiesterase 2A (PDE2A)
(Homo sapiens (Human))
BDBM50000908
(CHEMBL92363 | N-Cyclohexyl-N-methyl-4-(1-methyl-2-...)
Show SMILES CN(C1CCCCC1)C(=O)CCCOc1ccc2nc3[nH]c(=O)n(C)c3cc2c1
Show InChI InChI=1S/C22H28N4O3/c1-25(16-7-4-3-5-8-16)20(27)9-6-12-29-17-10-11-18-15(13-17)14-19-21(23-18)24-22(28)26(19)2/h10-11,13-14,16H,3-9,12H2,1-2H3,(H,23,24,28)
n/an/a 8.00E+3n/an/an/an/an/an/a
Bristol-Myers Squibb Pharmaceutical Research Institute
Curated by ChEMBL
Assay Description
Inhibition of human platelet PDE by inhibiting cyclic Guanosine monophosphate (cGMP) hydrolysis
J Med Chem 35: 2672-87 (1992)
BindingDB Entry DOI: 10.7270/Q2513X52