BDBM50001015 CHEMBL2403357
SMILES: CCCCC(CCCC)(c1ccc(O)c(C)c1)c1ccc(O)c(C)c1
InChI Key: InChIKey=GJWYBRFLOIAJTI-UHFFFAOYSA-N
Data: 3 IC50  1 EC50
Activity Spreadsheet -- Enzyme Inhibition Constant Data from BindingDB
Found 4 hits for monomerid = 50001015
Trg + Lig
Ki
nM
ΔG°
kcal/mole
IC50
nM
Kd
nM
EC50/IC50
nM
koff
s-1
kon
M-1s-1
pHTemp
°C
Estrogen receptor
(Homo sapiens (Human))
BDBM50001015
(CHEMBL2403357)
Show SMILES CCCCC(CCCC)(c1ccc(O)c(C)c1)c1ccc(O)c(C)c1
Show InChI InChI=1S/C23H32O2/c1-5-7-13-23(14-8-6-2,19-9-11-21(24)17(3)15-19)20-10-12-22(25)18(4)16-20/h9-12,15-16,24-25H,5-8,13-14H2,1-4H3
n/an/a 14n/an/an/an/an/an/a
The University of Tokyo
Curated by ChEMBL
Assay Description
Antagonist activity at human Gal4-fused ER-alpha expressed in HEK293 cells assessed as inhibition of 17beta-estradiol-induced effect by luciferase re...
Bioorg Med Chem 22: 2244-52 (2014)
Article DOI: 10.1016/j.bmc.2014.02.025
BindingDB Entry DOI: 10.7270/Q2H996QP
Estrogen receptor
(Homo sapiens (Human))
BDBM50001015
(CHEMBL2403357)
Show SMILES CCCCC(CCCC)(c1ccc(O)c(C)c1)c1ccc(O)c(C)c1
Show InChI InChI=1S/C23H32O2/c1-5-7-13-23(14-8-6-2,19-9-11-21(24)17(3)15-19)20-10-12-22(25)18(4)16-20/h9-12,15-16,24-25H,5-8,13-14H2,1-4H3
n/an/an/an/a 88n/an/an/an/a
the University of Tokyo
Curated by ChEMBL
Assay Description
Selective estrogen receptor down-regulator activity at FLAG-tagged ERalpha (unknown origin) expressed in HEK293 cells assessed as induction of ERalph...
Bioorg Med Chem 27: 1952-1961 (2019)
Article DOI: 10.1016/j.bmc.2019.03.042
Estrogen receptor
(Homo sapiens (Human))
BDBM50001015
(CHEMBL2403357)
Show SMILES CCCCC(CCCC)(c1ccc(O)c(C)c1)c1ccc(O)c(C)c1
Show InChI InChI=1S/C23H32O2/c1-5-7-13-23(14-8-6-2,19-9-11-21(24)17(3)15-19)20-10-12-22(25)18(4)16-20/h9-12,15-16,24-25H,5-8,13-14H2,1-4H3
n/an/a 14n/an/an/an/an/an/a
the University of Tokyo
Curated by ChEMBL
Assay Description
Antagonist activity at FLAG-tagged ERalpha (unknown origin) expressed in HEK293 cells assessed as reduction in E2-induced ER-alpha-mediated transcrip...
Bioorg Med Chem 27: 1952-1961 (2019)
Article DOI: 10.1016/j.bmc.2019.03.042
Estrogen receptor
(Homo sapiens (Human))
BDBM50001015
(CHEMBL2403357)
Show SMILES CCCCC(CCCC)(c1ccc(O)c(C)c1)c1ccc(O)c(C)c1
Show InChI InChI=1S/C23H32O2/c1-5-7-13-23(14-8-6-2,19-9-11-21(24)17(3)15-19)20-10-12-22(25)18(4)16-20/h9-12,15-16,24-25H,5-8,13-14H2,1-4H3
n/an/a 26n/an/an/an/an/an/a
the University of Tokyo
Curated by ChEMBL
Assay Description
Binding affinity to GST-tagged human ER alpha ligand-binding domain by TR-FRET assay
Bioorg Med Chem 27: 1952-1961 (2019)
Article DOI: 10.1016/j.bmc.2019.03.042