BDBM50001171 3-(Benzothiazol-2-ylsulfanyl)-propylamine-N-hydroxy carboxamide::CHEMBL419745
SMILES: CN(O)C(=O)NCCCSc1nc2ccccc2s1
InChI Key: InChIKey=HTSVYGUGMQHHQE-UHFFFAOYSA-N
Data: 1 EC50
Activity Spreadsheet -- Enzyme Inhibition Constant Data from BindingDB
Found 1 hit for monomerid = 50001171
Trg + Lig
Ki
nM
ΔG°
kcal/mole
IC50
nM
Kd
nM
EC50/IC50
nM
koff
s-1
kon
M-1s-1
pHTemp
°C
Arachidonate 5-lipoxygenase
(Homo sapiens (Human))
BDBM50001171
(3-(Benzothiazol-2-ylsulfanyl)-propylamine-N-hydrox...)
Show SMILES CN(O)C(=O)NCCCSc1nc2ccccc2s1
Show InChI InChI=1S/C12H15N3O2S2/c1-15(17)11(16)13-7-4-8-18-12-14-9-5-2-3-6-10(9)19-12/h2-3,5-6,17H,4,7-8H2,1H3,(H,13,16)
Reactome pathway
n/an/an/an/a 45n/an/an/an/a
R.W. Johnson Pharmaceutical Research Institute
Curated by ChEMBL
Assay Description
In vitro inhibition of ionophore stimulated LTB4 release from human peripheral blood leukocytes.
J Med Chem 35: 3180-3 (1992)
BindingDB Entry DOI: 10.7270/Q2542P68