BDBM50001182 2-(5-Chloro-benzothiazol-2-ylsulfanyl)-ethylamine-N-isopropyl-N-hydroxy carboxamide::CHEMBL110863
SMILES: CC(C)N(O)C(=O)NCCSc1nc2cc(Cl)ccc2s1
InChI Key: InChIKey=DWHPFYCYVAFBHA-UHFFFAOYSA-N
Data: 1 EC50
Activity Spreadsheet -- Enzyme Inhibition Constant Data from BindingDB
Found 1 hit for monomerid = 50001182
Trg + Lig
Ki
nM
ΔG°
kcal/mole
IC50
nM
Kd
nM
EC50/IC50
nM
koff
s-1
kon
M-1s-1
pHTemp
°C
Arachidonate 5-lipoxygenase
(Homo sapiens (Human))
BDBM50001182
(2-(5-Chloro-benzothiazol-2-ylsulfanyl)-ethylamine-...)
Show SMILES CC(C)N(O)C(=O)NCCSc1nc2cc(Cl)ccc2s1
Show InChI InChI=1S/C13H16ClN3O2S2/c1-8(2)17(19)12(18)15-5-6-20-13-16-10-7-9(14)3-4-11(10)21-13/h3-4,7-8,19H,5-6H2,1-2H3,(H,15,18)
Reactome pathway
n/an/an/an/a 70n/an/an/an/a
R.W. Johnson Pharmaceutical Research Institute
Curated by ChEMBL
Assay Description
In vitro inhibition of ionophore stimulated LTB4 release from human peripheral blood leukocytes.
J Med Chem 35: 3180-3 (1992)
BindingDB Entry DOI: 10.7270/Q2542P68