BDBM50001538 CHEMBL3237703
SMILES: C[C@H]1CC[C@@H](CC1)n1c2cnccc2c2cnc(Nc3ccc(cn3)N3CCNCC3)nc12
InChI Key: InChIKey=RKILQDBEPHSTGP-IYARVYRRSA-N
Data: 4 IC50
Activity Spreadsheet -- Enzyme Inhibition Constant Data from BindingDB
Found 4 hits for monomerid = 50001538
Trg + Lig
Ki
nM
ΔG°
kcal/mole
IC50
nM
Kd
nM
EC50/IC50
nM
koff
s-1
kon
M-1s-1
pHTemp
°C
Cyclin-Dependent Kinase 1 (CDK1)
(Homo sapiens (Human))
BDBM50001538
(CHEMBL3237703)
Show SMILES C[C@H]1CC[C@@H](CC1)n1c2cnccc2c2cnc(Nc3ccc(cn3)N3CCNCC3)nc12 |r,wU:4.7,wD:1.0,(47.68,-57.06,;47.21,-55.59,;48.24,-54.45,;47.78,-52.99,;46.29,-52.68,;45.25,-53.81,;45.71,-55.26,;45.82,-51.22,;46.72,-49.97,;48.26,-49.81,;48.89,-48.4,;47.98,-47.15,;46.45,-47.31,;45.82,-48.71,;44.35,-49.19,;43,-48.42,;41.68,-49.2,;41.69,-50.73,;40.36,-51.51,;40.36,-53.05,;41.7,-53.81,;41.7,-55.37,;40.36,-56.14,;39.03,-55.37,;39.03,-53.82,;40.36,-57.68,;39.02,-58.45,;39.02,-59.98,;40.35,-60.76,;41.69,-59.99,;41.7,-58.45,;43.02,-51.51,;44.34,-50.74,)|
Show InChI InChI=1S/C25H30N8/c1-17-2-4-18(5-3-17)33-22-16-27-9-8-20(22)21-15-29-25(31-24(21)33)30-23-7-6-19(14-28-23)32-12-10-26-11-13-32/h6-9,14-18,26H,2-5,10-13H2,1H3,(H,28,29,30,31)/t17-,18-
Reactome pathway
n/an/a 2.66E+3n/an/an/an/an/an/a
Amgen Inc.
Curated by ChEMBL
Assay Description
Inhibition of CDK1/cyclin B (unknown origin) using histone H1 as substrate after 60 mins by scintillation counting analysis in presence of [r-33P]ATP
J Med Chem 57: 3430-49 (2014)
Article DOI: 10.1021/jm500118j
BindingDB Entry DOI: 10.7270/Q2BK1DV4
Cyclin-Dependent Kinase 4 (CDK4)
(Homo sapiens (Human))
BDBM50001538
(CHEMBL3237703)
Show SMILES C[C@H]1CC[C@@H](CC1)n1c2cnccc2c2cnc(Nc3ccc(cn3)N3CCNCC3)nc12 |r,wU:4.7,wD:1.0,(47.68,-57.06,;47.21,-55.59,;48.24,-54.45,;47.78,-52.99,;46.29,-52.68,;45.25,-53.81,;45.71,-55.26,;45.82,-51.22,;46.72,-49.97,;48.26,-49.81,;48.89,-48.4,;47.98,-47.15,;46.45,-47.31,;45.82,-48.71,;44.35,-49.19,;43,-48.42,;41.68,-49.2,;41.69,-50.73,;40.36,-51.51,;40.36,-53.05,;41.7,-53.81,;41.7,-55.37,;40.36,-56.14,;39.03,-55.37,;39.03,-53.82,;40.36,-57.68,;39.02,-58.45,;39.02,-59.98,;40.35,-60.76,;41.69,-59.99,;41.7,-58.45,;43.02,-51.51,;44.34,-50.74,)|
Show InChI InChI=1S/C25H30N8/c1-17-2-4-18(5-3-17)33-22-16-27-9-8-20(22)21-15-29-25(31-24(21)33)30-23-7-6-19(14-28-23)32-12-10-26-11-13-32/h6-9,14-18,26H,2-5,10-13H2,1H3,(H,28,29,30,31)/t17-,18-
NCI pathway
Reactome pathway
n/an/a 7n/an/an/an/an/an/a
Amgen Inc.
Curated by ChEMBL
Assay Description
Inhibition of CDK4/cyclin D1 (unknown origin) using Rb as substrate after 60 mins by scintillation counting analysis in presence of [r-33P]ATP
J Med Chem 57: 3430-49 (2014)
Article DOI: 10.1021/jm500118j
BindingDB Entry DOI: 10.7270/Q2BK1DV4
Cytochrome P450 3A4
(Homo sapiens (Human))
BDBM50001538
(CHEMBL3237703)
Show SMILES C[C@H]1CC[C@@H](CC1)n1c2cnccc2c2cnc(Nc3ccc(cn3)N3CCNCC3)nc12 |r,wU:4.7,wD:1.0,(47.68,-57.06,;47.21,-55.59,;48.24,-54.45,;47.78,-52.99,;46.29,-52.68,;45.25,-53.81,;45.71,-55.26,;45.82,-51.22,;46.72,-49.97,;48.26,-49.81,;48.89,-48.4,;47.98,-47.15,;46.45,-47.31,;45.82,-48.71,;44.35,-49.19,;43,-48.42,;41.68,-49.2,;41.69,-50.73,;40.36,-51.51,;40.36,-53.05,;41.7,-53.81,;41.7,-55.37,;40.36,-56.14,;39.03,-55.37,;39.03,-53.82,;40.36,-57.68,;39.02,-58.45,;39.02,-59.98,;40.35,-60.76,;41.69,-59.99,;41.7,-58.45,;43.02,-51.51,;44.34,-50.74,)|
Show InChI InChI=1S/C25H30N8/c1-17-2-4-18(5-3-17)33-22-16-27-9-8-20(22)21-15-29-25(31-24(21)33)30-23-7-6-19(14-28-23)32-12-10-26-11-13-32/h6-9,14-18,26H,2-5,10-13H2,1H3,(H,28,29,30,31)/t17-,18-
Reactome pathway
n/an/a>1.00E+4n/an/an/an/an/an/a
Amgen Inc.
Curated by ChEMBL
Assay Description
Inhibition of CYP3A4 (unknown origin)
J Med Chem 57: 3430-49 (2014)
Article DOI: 10.1021/jm500118j
BindingDB Entry DOI: 10.7270/Q2BK1DV4
Receptor-type tyrosine-protein kinase FLT3
(Homo sapiens (Human))
BDBM50001538
(CHEMBL3237703)
Show SMILES C[C@H]1CC[C@@H](CC1)n1c2cnccc2c2cnc(Nc3ccc(cn3)N3CCNCC3)nc12 |r,wU:4.7,wD:1.0,(47.68,-57.06,;47.21,-55.59,;48.24,-54.45,;47.78,-52.99,;46.29,-52.68,;45.25,-53.81,;45.71,-55.26,;45.82,-51.22,;46.72,-49.97,;48.26,-49.81,;48.89,-48.4,;47.98,-47.15,;46.45,-47.31,;45.82,-48.71,;44.35,-49.19,;43,-48.42,;41.68,-49.2,;41.69,-50.73,;40.36,-51.51,;40.36,-53.05,;41.7,-53.81,;41.7,-55.37,;40.36,-56.14,;39.03,-55.37,;39.03,-53.82,;40.36,-57.68,;39.02,-58.45,;39.02,-59.98,;40.35,-60.76,;41.69,-59.99,;41.7,-58.45,;43.02,-51.51,;44.34,-50.74,)|
Show InChI InChI=1S/C25H30N8/c1-17-2-4-18(5-3-17)33-22-16-27-9-8-20(22)21-15-29-25(31-24(21)33)30-23-7-6-19(14-28-23)32-12-10-26-11-13-32/h6-9,14-18,26H,2-5,10-13H2,1H3,(H,28,29,30,31)/t17-,18-
n/an/a 2n/an/an/an/an/an/a
Amgen Inc.
Curated by ChEMBL
Assay Description
Inhibition of GST-fused human FLT3 cytoplasmic domain (amino acids 564 to 993) using Ulight-JAK1 as substrate after 1 hr by TR-FRET assay
J Med Chem 57: 3430-49 (2014)
Article DOI: 10.1021/jm500118j
BindingDB Entry DOI: 10.7270/Q2BK1DV4