BDBM50001745 CHEMBL3238098
SMILES: COc1ccc(Nc2ccnc3[nH]c4ccccc4c23)cc1
InChI Key: InChIKey=KAUBARMCYDRJAU-UHFFFAOYSA-N
Data: 1 IC50
Activity Spreadsheet -- Enzyme Inhibition Constant Data from BindingDB
Found 1 hit for monomerid = 50001745
Trg + Lig
Ki
nM
ΔG°
kcal/mole
IC50
nM
Kd
nM
EC50/IC50
nM
koff
s-1
kon
M-1s-1
pHTemp
°C
Tyrosine-protein kinase BRK
(Homo sapiens (Human))
BDBM50001745
(CHEMBL3238098)
Show SMILES COc1ccc(Nc2ccnc3[nH]c4ccccc4c23)cc1
Show InChI InChI=1S/C18H15N3O/c1-22-13-8-6-12(7-9-13)20-16-10-11-19-18-17(16)14-4-2-3-5-15(14)21-18/h2-11H,1H3,(H2,19,20,21)
n/an/a 190n/an/an/an/an/an/a
Martin-Luther University Halle-Wittenberg
Curated by ChEMBL
Assay Description
Inhibition of Brk (unknown origin) using [gamma-33P]-ATP after 60 mins by scintillation counting
Bioorg Med Chem Lett 24: 1948-51 (2014)
Article DOI: 10.1016/j.bmcl.2014.03.002
BindingDB Entry DOI: 10.7270/Q2TM7CN0