BDBM50001938 CHEMBL3233604
SMILES: O=C(CC1CCCC1)Nc1nccs1
InChI Key: InChIKey=VVQKQIRCLCVCAT-UHFFFAOYSA-N
Data: 1 IC50
PDB links: 1 PDB ID matches this monomer.
Activity Spreadsheet -- Enzyme Inhibition Constant Data from BindingDB
Found 1 hit for monomerid = 50001938
Trg + Lig
Ki
nM
ΔG°
kcal/mole
IC50
nM
Kd
nM
EC50/IC50
nM
koff
s-1
kon
M-1s-1
pHTemp
°C
EBifunctional epoxide hydrolase 2
(Homo sapiens (Human))
BDBM50001938
(CHEMBL3233604)
Show SMILES O=C(CC1CCCC1)Nc1nccs1
Show InChI InChI=1S/C10H14N2OS/c13-9(7-8-3-1-2-4-8)12-10-11-5-6-14-10/h5-6,8H,1-4,7H2,(H,11,12,13)
n/an/a 1.50E+4n/an/an/an/an/an/a
Astellas Pharma Inc.
Curated by ChEMBL
Assay Description
Inhibition of human full-length C-terminal His6-tagged sEH expressed in Escherichia coli BL21(DE3) cells using PHOME as substrate incubated with enzy...
Bioorg Med Chem 22: 2427-34 (2014)
Article DOI: 10.1016/j.bmc.2014.03.001
BindingDB Entry DOI: 10.7270/Q2NV9KRF
3D
3D Structure (crystal)