BDBM50002008 1-(2-{4-[1-(4-Fluoro-phenyl)-5-methyl-1H-indol-3-yl]-piperidin-1-yl}-ethyl)-imidazolidin-2-one::CHEMBL267304
SMILES: Cc1ccc2n(cc(C3CCN(CCN4CCNC4=O)CC3)c2c1)-c1ccc(F)cc1
InChI Key: InChIKey=ARZIOMWQBRPJMY-UHFFFAOYSA-N
Data: 2 IC50
Activity Spreadsheet -- Enzyme Inhibition Constant Data from BindingDB
Found 2 hits for monomerid = 50002008
Trg + Lig
Ki
nM
ΔG°
kcal/mole
IC50
nM
Kd
nM
EC50/IC50
nM
koff
s-1
kon
M-1s-1
pHTemp
°C
Serotonin 2 (5-HT2) receptor
(Rattus norvegicus (rat)-RAT-Rattus norvegicus (Rat...)
BDBM50002008
(1-(2-{4-[1-(4-Fluoro-phenyl)-5-methyl-1H-indol-3-y...)
Show SMILES Cc1ccc2n(cc(C3CCN(CCN4CCNC4=O)CC3)c2c1)-c1ccc(F)cc1
Show InChI InChI=1S/C25H29FN4O/c1-18-2-7-24-22(16-18)23(17-30(24)21-5-3-20(26)4-6-21)19-8-11-28(12-9-19)14-15-29-13-10-27-25(29)31/h2-7,16-17,19H,8-15H2,1H3,(H,27,31)
n/an/a 0.300n/an/an/an/an/an/a
H. Lundbeck A/S
Curated by ChEMBL
Assay Description
Inhibition of [3H]ketanserin binding to rat 5-hydroxytryptamine 2 receptors.
J Med Chem 35: 1092-101 (1992)
BindingDB Entry DOI: 10.7270/Q2Z89BB3
D(2) dopamine receptor
(Rattus norvegicus (rat))
BDBM50002008
(1-(2-{4-[1-(4-Fluoro-phenyl)-5-methyl-1H-indol-3-y...)
Show SMILES Cc1ccc2n(cc(C3CCN(CCN4CCNC4=O)CC3)c2c1)-c1ccc(F)cc1
Show InChI InChI=1S/C25H29FN4O/c1-18-2-7-24-22(16-18)23(17-30(24)21-5-3-20(26)4-6-21)19-8-11-28(12-9-19)14-15-29-13-10-27-25(29)31/h2-7,16-17,19H,8-15H2,1H3,(H,27,31)
Reactome pathway
n/an/a 3.70n/an/an/an/an/an/a
H. Lundbeck A/S
Curated by ChEMBL
Assay Description
Tested for the inhibition of [3H]-spiperone binding to dopamine D2 receptor
J Med Chem 35: 1092-101 (1992)
BindingDB Entry DOI: 10.7270/Q2Z89BB3