BDBM50002024 (1-Mercaptomethyl-3-methyl-butyl)-methyl-ammonium
SMILES: C[NH2+]C(CS)CC(C)C
InChI Key: InChIKey=NSJNXFIDIQRRNO-UHFFFAOYSA-O
Data: 1 IC50
Activity Spreadsheet -- Enzyme Inhibition Constant Data from BindingDB
Found 1 hit for monomerid = 50002024
Trg + Lig
Ki
nM
ΔG°
kcal/mole
IC50
nM
Kd
nM
EC50/IC50
nM
koff
s-1
kon
M-1s-1
pHTemp
°C
Aminopeptidase N
(Sus scrofa (Pig))
BDBM50002024
((1-Mercaptomethyl-3-methyl-butyl)-methyl-ammonium)
Show SMILES C[NH2+]C(CS)CC(C)C
Show InChI InChI=1S/C7H17NS/c1-6(2)4-7(5-9)8-3/h6-9H,4-5H2,1-3H3/p+1
n/an/a 4.00E+3n/an/an/an/an/an/a
INSERM
Curated by ChEMBL
Assay Description
Inhibition of [3H]Leu-enkephalin binding to Aminopeptidase N from hog kidney
J Med Chem 35: 1259-66 (1992)
BindingDB Entry DOI: 10.7270/Q2125T81