BDBM50002084 11-(2-Dimethylamino-ethylsulfanyl)-6,11-dihydro-dibenzo[b,e]oxepine-2-carboxylic acid; hydrochloride::CHEMBL336317::CHEMBL538750
SMILES: CN(C)CCSC1c2ccccc2COc2ccc(cc12)C(O)=O
InChI Key: InChIKey=REZNTTJXTCGLCG-UHFFFAOYSA-N
Data: 2 KI
Activity Spreadsheet -- Enzyme Inhibition Constant Data from BindingDB
Found 2 hits for monomerid = 50002084
Trg + Lig
Ki
nM
ΔG°
kcal/mole
IC50
nM
Kd
nM
EC50/IC50
nM
koff
s-1
kon
M-1s-1
pHTemp
°C
Histamine H1 receptor
(Cavia porcellus (domestic guinea pig))
BDBM50002084
(11-(2-Dimethylamino-ethylsulfanyl)-6,11-dihydro-di...)
Show SMILES CN(C)CCSC1c2ccccc2COc2ccc(cc12)C(O)=O
Show InChI InChI=1S/C19H21NO3S/c1-20(2)9-10-24-18-15-6-4-3-5-14(15)12-23-17-8-7-13(19(21)22)11-16(17)18/h3-8,11,18H,9-10,12H2,1-2H3,(H,21,22)
9n/an/an/an/an/an/an/an/a
Kyowa Hakko Kogyo Co.
Curated by ChEMBL
Assay Description
Inhibition of the specific binding of [3H]-pyrilamine to guinea pig cerebellum histamine H1 receptor
J Med Chem 36: 417-20 (1993)
BindingDB Entry DOI: 10.7270/Q2Q23Z9K
Histamine H1 receptor
(Cavia porcellus (domestic guinea pig))
BDBM50002084
(11-(2-Dimethylamino-ethylsulfanyl)-6,11-dihydro-di...)
Show SMILES CN(C)CCSC1c2ccccc2COc2ccc(cc12)C(O)=O
Show InChI InChI=1S/C19H21NO3S/c1-20(2)9-10-24-18-15-6-4-3-5-14(15)12-23-17-8-7-13(19(21)22)11-16(17)18/h3-8,11,18H,9-10,12H2,1-2H3,(H,21,22)
14n/an/an/an/an/an/an/an/a
Kyowa Hakko Kogyo Co., Ltd.
Curated by ChEMBL
Assay Description
Binding affinity for histamine H1 receptor from guinea pig cerebellum, using [3H]pyrilamine as radioligand at 0.1 uM
J Med Chem 35: 2074-84 (1992)
BindingDB Entry DOI: 10.7270/Q2N87BC0