BDBM50002103 3-[11-(3-Dimethylamino-propylidene)-6,11-dihydro-dibenzo[b,e]oxepin-2-yl]-propionic acid::CHEMBL293652
SMILES: CN(C)CC\C=C1/c2ccccc2COc2ccc(CCC(O)=O)cc12
InChI Key: InChIKey=MBORUECSHYIVDB-UFWORHAWSA-N
Data: 1 KI
Activity Spreadsheet -- Enzyme Inhibition Constant Data from BindingDB
Found 1 hit for monomerid = 50002103
Trg + Lig
Ki
nM
ΔG°
kcal/mole
IC50
nM
Kd
nM
EC50/IC50
nM
koff
s-1
kon
M-1s-1
pHTemp
°C
Histamine H1 receptor
(Cavia porcellus (domestic guinea pig))
BDBM50002103
(3-[11-(3-Dimethylamino-propylidene)-6,11-dihydro-d...)
Show SMILES CN(C)CC\C=C1/c2ccccc2COc2ccc(CCC(O)=O)cc12
Show InChI InChI=1S/C22H25NO3/c1-23(2)13-5-8-19-18-7-4-3-6-17(18)15-26-21-11-9-16(14-20(19)21)10-12-22(24)25/h3-4,6-9,11,14H,5,10,12-13,15H2,1-2H3,(H,24,25)/b19-8+
4.20n/an/an/an/an/an/an/an/a
Kyowa Hakko Kogyo Co., Ltd.
Curated by ChEMBL
Assay Description
Binding affinity for histamine H1 receptor from guinea pig cerebellum, using [3H]pyrilamine as radioligand at 0.1 uM
J Med Chem 35: 2074-84 (1992)
BindingDB Entry DOI: 10.7270/Q2N87BC0