BDBM50002161 3-[4-(3,6-Dihydro-2H-pyridin-1-yl)-butyl]-1H-indole::CHEMBL130605
SMILES: C(CCc1c[nH]c2ccccc12)CN1CCC=CC1
InChI Key: InChIKey=RNGZXDOUGRHLBQ-UHFFFAOYSA-N
Data: 1 KI  1 IC50
Activity Spreadsheet -- Enzyme Inhibition Constant Data from BindingDB
Found 2 hits for monomerid = 50002161
Trg + Lig
Ki
nM
ΔG°
kcal/mole
IC50
nM
Kd
nM
EC50/IC50
nM
koff
s-1
kon
M-1s-1
pHTemp
°C
D(2) dopamine receptor
(Rattus norvegicus (rat))
BDBM50002161
(3-[4-(3,6-Dihydro-2H-pyridin-1-yl)-butyl]-1H-indol...)
Show SMILES C(CCc1c[nH]c2ccccc12)CN1CCC=CC1 |c:18|
Show InChI InChI=1S/C17H22N2/c1-5-11-19(12-6-1)13-7-4-8-15-14-18-17-10-3-2-9-16(15)17/h1-3,5,9-10,14,18H,4,6-8,11-13H2
Reactome pathway
>1.00E+3n/an/an/an/an/an/an/an/a
E. Merck Darmstadt
Curated by ChEMBL
Assay Description
Evaluated for its ability to displace tritiated receptor ligand in rat striatal membranes [3H]ADTN, a dopamine agonist
J Med Chem 35: 4020-6 (1992)
BindingDB Entry DOI: 10.7270/Q2K0736G
D(2) dopamine receptor
(Rattus norvegicus (rat))
BDBM50002161
(3-[4-(3,6-Dihydro-2H-pyridin-1-yl)-butyl]-1H-indol...)
Show SMILES C(CCc1c[nH]c2ccccc12)CN1CCC=CC1 |c:18|
Show InChI InChI=1S/C17H22N2/c1-5-11-19(12-6-1)13-7-4-8-15-14-18-17-10-3-2-9-16(15)17/h1-3,5,9-10,14,18H,4,6-8,11-13H2
Reactome pathway
n/an/a>1.00E+3n/an/an/an/an/an/a
E. Merck Darmstadt
Curated by ChEMBL
Assay Description
Evaluated for its ability to displace tritiated receptor ligand in rat striatal membranes 3[H]spiperone, a dopamine antagonist
J Med Chem 35: 4020-6 (1992)
BindingDB Entry DOI: 10.7270/Q2K0736G