BDBM50002219 1-Benzyl-4-cyclopropoxymethyl-piperidine; compound with but-2-enedioic acid::CHEMBL344422
SMILES: C(OC1CC1)C1CCN(Cc2ccccc2)CC1
InChI Key: InChIKey=CTARQXSEHSYSMH-UHFFFAOYSA-N
Data: 2 KI  1 IC50
Activity Spreadsheet -- Enzyme Inhibition Constant Data from BindingDB
Found 3 hits for monomerid = 50002219
Trg + Lig
Ki
nM
ΔG°
kcal/mole
IC50
nM
Kd
nM
EC50/IC50
nM
koff
s-1
kon
M-1s-1
pHTemp
°C
Sigma non-opioid intracellular receptor 1
(Mus musculus (Mouse))
BDBM50002219
(1-Benzyl-4-cyclopropoxymethyl-piperidine; compound...)
Show SMILES C(OC1CC1)C1CCN(Cc2ccccc2)CC1
Show InChI InChI=1S/C16H23NO/c1-2-4-14(5-3-1)12-17-10-8-15(9-11-17)13-18-16-6-7-16/h1-5,15-16H,6-13H2
2n/an/an/an/an/an/an/an/a
Du Pont Merck Pharmaceutical Company
Curated by ChEMBL
Assay Description
In vitro binding affinity for the mouse sigma opioid receptor
J Med Chem 35: 4344-61 (1992)
BindingDB Entry DOI: 10.7270/Q28P614G
Serotonin 2 (5-HT2) receptor
(Mus musculus (Mouse))
BDBM50002219
(1-Benzyl-4-cyclopropoxymethyl-piperidine; compound...)
Show SMILES C(OC1CC1)C1CCN(Cc2ccccc2)CC1
Show InChI InChI=1S/C16H23NO/c1-2-4-14(5-3-1)12-17-10-8-15(9-11-17)13-18-16-6-7-16/h1-5,15-16H,6-13H2
>1.00E+4n/an/an/an/an/an/an/an/a
Du Pont Merck Pharmaceutical Company
Curated by ChEMBL
Assay Description
In vitro binding affinity for serotonin 5-hydroxytryptamine (5-HT) 2 receptors
J Med Chem 35: 4344-61 (1992)
BindingDB Entry DOI: 10.7270/Q28P614G
D(2) dopamine receptor
(Mus musculus (Mouse))
BDBM50002219
(1-Benzyl-4-cyclopropoxymethyl-piperidine; compound...)
Show SMILES C(OC1CC1)C1CCN(Cc2ccccc2)CC1
Show InChI InChI=1S/C16H23NO/c1-2-4-14(5-3-1)12-17-10-8-15(9-11-17)13-18-16-6-7-16/h1-5,15-16H,6-13H2
n/an/a>1.00E+4n/an/an/an/an/an/a
Du Pont Merck Pharmaceutical Company
Curated by ChEMBL
Assay Description
In vitro binding affinity towards dopamine receptor D2
J Med Chem 35: 4344-61 (1992)
BindingDB Entry DOI: 10.7270/Q28P614G