BDBM50002235 1-Benzyl-4-(4-trifluoromethyl-phenoxymethyl)-piperidine::CHEMBL137768
SMILES: FC(F)(F)c1ccc(OCC2CCN(Cc3ccccc3)CC2)cc1
InChI Key: InChIKey=NSLABBCHOFZJPV-UHFFFAOYSA-N
Data: 2 KI  1 IC50
Activity Spreadsheet -- Enzyme Inhibition Constant Data from BindingDB
Found 3 hits for monomerid = 50002235
Trg + Lig
Ki
nM
ΔG°
kcal/mole
IC50
nM
Kd
nM
EC50/IC50
nM
koff
s-1
kon
M-1s-1
pHTemp
°C
Sigma non-opioid intracellular receptor 1
(Mus musculus (Mouse))
BDBM50002235
(1-Benzyl-4-(4-trifluoromethyl-phenoxymethyl)-piper...)
Show SMILES FC(F)(F)c1ccc(OCC2CCN(Cc3ccccc3)CC2)cc1
Show InChI InChI=1S/C20H22F3NO/c21-20(22,23)18-6-8-19(9-7-18)25-15-17-10-12-24(13-11-17)14-16-4-2-1-3-5-16/h1-9,17H,10-15H2
2n/an/an/an/an/an/an/an/a
Du Pont Merck Pharmaceutical Company
Curated by ChEMBL
Assay Description
In vitro binding affinity for the mouse sigma opioid receptor
J Med Chem 35: 4344-61 (1992)
BindingDB Entry DOI: 10.7270/Q28P614G
Serotonin 2 (5-HT2) receptor
(Mus musculus (Mouse))
BDBM50002235
(1-Benzyl-4-(4-trifluoromethyl-phenoxymethyl)-piper...)
Show SMILES FC(F)(F)c1ccc(OCC2CCN(Cc3ccccc3)CC2)cc1
Show InChI InChI=1S/C20H22F3NO/c21-20(22,23)18-6-8-19(9-7-18)25-15-17-10-12-24(13-11-17)14-16-4-2-1-3-5-16/h1-9,17H,10-15H2
350n/an/an/an/an/an/an/an/a
Du Pont Merck Pharmaceutical Company
Curated by ChEMBL
Assay Description
In vitro binding affinity for serotonin 5-hydroxytryptamine (5-HT) 2 receptors
J Med Chem 35: 4344-61 (1992)
BindingDB Entry DOI: 10.7270/Q28P614G
D(2) dopamine receptor
(Mus musculus (Mouse))
BDBM50002235
(1-Benzyl-4-(4-trifluoromethyl-phenoxymethyl)-piper...)
Show SMILES FC(F)(F)c1ccc(OCC2CCN(Cc3ccccc3)CC2)cc1
Show InChI InChI=1S/C20H22F3NO/c21-20(22,23)18-6-8-19(9-7-18)25-15-17-10-12-24(13-11-17)14-16-4-2-1-3-5-16/h1-9,17H,10-15H2
n/an/a 1.93E+3n/an/an/an/an/an/a
Du Pont Merck Pharmaceutical Company
Curated by ChEMBL
Assay Description
In vitro binding affinity towards dopamine receptor D2
J Med Chem 35: 4344-61 (1992)
BindingDB Entry DOI: 10.7270/Q28P614G