BDBM50002288 1-(4-Fluoro-phenyl)-2-{1-[2-(4-trifluoromethyl-phenyl)-ethyl]-piperidin-4-yl}-ethanone::CHEMBL136794
SMILES: Fc1ccc(cc1)C(=O)CC1CCN(CCc2ccc(cc2)C(F)(F)F)CC1
InChI Key: InChIKey=JXDNMESNLICMIF-UHFFFAOYSA-N
Data: 2 KI  1 IC50
Activity Spreadsheet -- Enzyme Inhibition Constant Data from BindingDB
Found 3 hits for monomerid = 50002288
Trg + Lig
Ki
nM
ΔG°
kcal/mole
IC50
nM
Kd
nM
EC50/IC50
nM
koff
s-1
kon
M-1s-1
pHTemp
°C
Serotonin 2 (5-HT2) receptor
(Mus musculus (Mouse))
BDBM50002288
(1-(4-Fluoro-phenyl)-2-{1-[2-(4-trifluoromethyl-phe...)
Show SMILES Fc1ccc(cc1)C(=O)CC1CCN(CCc2ccc(cc2)C(F)(F)F)CC1
Show InChI InChI=1S/C22H23F4NO/c23-20-7-3-18(4-8-20)21(28)15-17-10-13-27(14-11-17)12-9-16-1-5-19(6-2-16)22(24,25)26/h1-8,17H,9-15H2
3.30n/an/an/an/an/an/an/an/a
Du Pont Merck Pharmaceutical Company
Curated by ChEMBL
Assay Description
In vitro binding affinity for serotonin 5-hydroxytryptamine (5-HT) 2 receptors
J Med Chem 35: 4344-61 (1992)
BindingDB Entry DOI: 10.7270/Q28P614G
Sigma non-opioid intracellular receptor 1
(Mus musculus (Mouse))
BDBM50002288
(1-(4-Fluoro-phenyl)-2-{1-[2-(4-trifluoromethyl-phe...)
Show SMILES Fc1ccc(cc1)C(=O)CC1CCN(CCc2ccc(cc2)C(F)(F)F)CC1
Show InChI InChI=1S/C22H23F4NO/c23-20-7-3-18(4-8-20)21(28)15-17-10-13-27(14-11-17)12-9-16-1-5-19(6-2-16)22(24,25)26/h1-8,17H,9-15H2
9n/an/an/an/an/an/an/an/a
Du Pont Merck Pharmaceutical Company
Curated by ChEMBL
Assay Description
In vitro binding affinity for the mouse sigma opioid receptor
J Med Chem 35: 4344-61 (1992)
BindingDB Entry DOI: 10.7270/Q28P614G
D(2) dopamine receptor
(Mus musculus (Mouse))
BDBM50002288
(1-(4-Fluoro-phenyl)-2-{1-[2-(4-trifluoromethyl-phe...)
Show SMILES Fc1ccc(cc1)C(=O)CC1CCN(CCc2ccc(cc2)C(F)(F)F)CC1
Show InChI InChI=1S/C22H23F4NO/c23-20-7-3-18(4-8-20)21(28)15-17-10-13-27(14-11-17)12-9-16-1-5-19(6-2-16)22(24,25)26/h1-8,17H,9-15H2
n/an/a 10n/an/an/an/an/an/a
Du Pont Merck Pharmaceutical Company
Curated by ChEMBL
Assay Description
In vitro binding affinity towards dopamine receptor D2
J Med Chem 35: 4344-61 (1992)
BindingDB Entry DOI: 10.7270/Q28P614G