BDBM50002342 CHEMBL3233606
SMILES: Nc1ncc(Cc2ccc(Br)cc2)s1
InChI Key: InChIKey=HGWLTZOMQZIUBW-UHFFFAOYSA-N
Data: 1 IC50
PDB links: 1 PDB ID matches this monomer.
Activity Spreadsheet -- Enzyme Inhibition Constant Data from BindingDB
Found 1 hit for monomerid = 50002342
Trg + Lig
Ki
nM
ΔG°
kcal/mole
IC50
nM
Kd
nM
EC50/IC50
nM
koff
s-1
kon
M-1s-1
pHTemp
°C
EBifunctional epoxide hydrolase 2
(Homo sapiens (Human))
BDBM50002342
(CHEMBL3233606)
Show SMILES Nc1ncc(Cc2ccc(Br)cc2)s1
Show InChI InChI=1S/C10H9BrN2S/c11-8-3-1-7(2-4-8)5-9-6-13-10(12)14-9/h1-4,6H,5H2,(H2,12,13)
n/an/a 7.00E+4n/an/an/an/an/an/a
Astellas Pharma Inc.
Curated by ChEMBL
Assay Description
Inhibition of human full-length C-terminal His6-tagged sEH expressed in Escherichia coli BL21(DE3) cells using PHOME as substrate incubated with enzy...
Bioorg Med Chem 22: 2427-34 (2014)
Article DOI: 10.1016/j.bmc.2014.03.001
BindingDB Entry DOI: 10.7270/Q2NV9KRF
3D
3D Structure (crystal)