BDBM50002348 CHEMBL2094355::DNDI1416972
SMILES: O=C1CN(Cc2ccccc2)c2ccccc2N1
InChI Key: InChIKey=BSCQZYGHGGBKLI-UHFFFAOYSA-N
Data: 1 IC50
PDB links: 1 PDB ID matches this monomer.
Activity Spreadsheet -- Enzyme Inhibition Constant Data from BindingDB
Found 1 hit for monomerid = 50002348
Trg + Lig
Ki
nM
ΔG°
kcal/mole
IC50
nM
Kd
nM
EC50/IC50
nM
koff
s-1
kon
M-1s-1
pHTemp
°C
EBifunctional epoxide hydrolase 2
(Homo sapiens (Human))
BDBM50002348
(CHEMBL2094355 | DNDI1416972)
Show SMILES O=C1CN(Cc2ccccc2)c2ccccc2N1
Show InChI InChI=1S/C15H14N2O/c18-15-11-17(10-12-6-2-1-3-7-12)14-9-5-4-8-13(14)16-15/h1-9H,10-11H2,(H,16,18)
n/an/a 6.10E+4n/an/an/an/an/an/a
Astellas Pharma Inc.
Curated by ChEMBL
Assay Description
Inhibition of human full-length C-terminal His6-tagged sEH expressed in Escherichia coli BL21(DE3) cells using PHOME as substrate incubated with enzy...
Bioorg Med Chem 22: 2427-34 (2014)
Article DOI: 10.1016/j.bmc.2014.03.001
BindingDB Entry DOI: 10.7270/Q2NV9KRF
3D
3D Structure (crystal)