BDBM50002580 2,6-Dimethyl-4-(2-nitro-phenyl)-1,4-dihydro-pyridine-3,5-dicarboxylic acid 3-(tetrahydro-pyran-2-ylmethyl) ester 5-(1,1,3-trioxo-1,3-dihydro-1lambda*6*-benzo[d]isothiazol-2-ylmethyl) ester::CHEMBL80501
SMILES: CC1=NC(C)=C(C(C1=C([O-])OCN1C(=O)c2ccccc2S1(=O)=O)c1ccccc1[N+]([O-])=O)C(=[OH+])OCC1CCCCO1
InChI Key: InChIKey=VGHWATKVSWORPV-UHFFFAOYSA-N
Data: 1 IC50
Activity Spreadsheet -- Enzyme Inhibition Constant Data from BindingDB
Found 1 hit for monomerid = 50002580
Trg + Lig
Ki
nM
ΔG°
kcal/mole
IC50
nM
Kd
nM
EC50/IC50
nM
koff
s-1
kon
M-1s-1
pHTemp
°C
Voltage-dependent L-type calcium channel subunit alpha-1C
(Oryctolagus cuniculus)
BDBM50002580
(2,6-Dimethyl-4-(2-nitro-phenyl)-1,4-dihydro-pyridi...)
Show SMILES CC1=NC(C)=C(C(C1=C([O-])OCN1C(=O)c2ccccc2S1(=O)=O)c1ccccc1[N+]([O-])=O)C(=[OH+])OCC1CCCCO1 |w:8.9,c:4,t:1|
Show InChI InChI=1S/C29H29N3O10S/c1-17-24(28(34)41-15-19-9-7-8-14-40-19)26(20-10-3-5-12-22(20)32(36)37)25(18(2)30-17)29(35)42-16-31-27(33)21-11-4-6-13-23(21)43(31,38)39/h3-6,10-13,19,26,35H,7-9,14-16H2,1-2H3
Reactome pathway
n/an/a 25n/an/an/an/an/an/a
Alter, S.A.
Curated by ChEMBL
Assay Description
Blockade of calcium-evoked contractions in depolarized aortic strips
J Med Chem 35: 2407-14 (1992)
BindingDB Entry DOI: 10.7270/Q2BV7H7B