BDBM50002746 CHEMBL217545
SMILES: ONC(=O)CCCCSc1nc(cc(=O)[nH]1)-c1cccc(Cl)c1
InChI Key: InChIKey=UBKSBANVHOVYGV-UHFFFAOYSA-N
Data: 4 IC50
Activity Spreadsheet -- Enzyme Inhibition Constant Data from BindingDB
Found 4 hits for monomerid = 50002746
Trg + Lig
Ki
nM
ΔG°
kcal/mole
IC50
nM
Kd
nM
EC50/IC50
nM
koff
s-1
kon
M-1s-1
pHTemp
°C
Histone deacetylase HD1B
(Zea mays)
BDBM50002746
(CHEMBL217545)
Show SMILES ONC(=O)CCCCSc1nc(cc(=O)[nH]1)-c1cccc(Cl)c1
Show InChI InChI=1S/C15H16ClN3O3S/c16-11-5-3-4-10(8-11)12-9-14(21)18-15(17-12)23-7-2-1-6-13(20)19-22/h3-5,8-9,22H,1-2,6-7H2,(H,19,20)(H,17,18,21)
n/an/a 0.00400n/an/an/an/an/an/a
Universit£ degli Studi di Roma La Sapienza
Curated by ChEMBL
Assay Description
Inhibition of maize HD1-B (mean)
Bioorg Med Chem Lett 17: 1221-5 (2007)
Article DOI: 10.1016/j.bmcl.2006.12.028
BindingDB Entry DOI: 10.7270/Q29W0H0K
Histone deacetylase 1
(Mus musculus (Mouse))
BDBM50002746
(CHEMBL217545)
Show SMILES ONC(=O)CCCCSc1nc(cc(=O)[nH]1)-c1cccc(Cl)c1
Show InChI InChI=1S/C15H16ClN3O3S/c16-11-5-3-4-10(8-11)12-9-14(21)18-15(17-12)23-7-2-1-6-13(20)19-22/h3-5,8-9,22H,1-2,6-7H2,(H,19,20)(H,17,18,21)
Reactome pathway
n/an/a 0.0130n/an/an/an/an/an/a
Universit£ degli Studi di Roma La Sapienza
Curated by ChEMBL
Assay Description
Inhibition of mouse HDAC1 (mean)
Bioorg Med Chem Lett 17: 1221-5 (2007)
Article DOI: 10.1016/j.bmcl.2006.12.028
BindingDB Entry DOI: 10.7270/Q29W0H0K
Histone deacetylase HD2
(Zea mays)
BDBM50002746
(CHEMBL217545)
Show SMILES ONC(=O)CCCCSc1nc(cc(=O)[nH]1)-c1cccc(Cl)c1
Show InChI InChI=1S/C15H16ClN3O3S/c16-11-5-3-4-10(8-11)12-9-14(21)18-15(17-12)23-7-2-1-6-13(20)19-22/h3-5,8-9,22H,1-2,6-7H2,(H,19,20)(H,17,18,21)
n/an/a 0.00600n/an/an/an/an/an/a
Universit£ degli Studi di Roma La Sapienza
Curated by ChEMBL
Assay Description
Inhibition of maize HD2 (mean)
Bioorg Med Chem Lett 17: 1221-5 (2007)
Article DOI: 10.1016/j.bmcl.2006.12.028
BindingDB Entry DOI: 10.7270/Q29W0H0K
Histone deacetylase 4
(Homo sapiens (Human))
BDBM50002746
(CHEMBL217545)
Show SMILES ONC(=O)CCCCSc1nc(cc(=O)[nH]1)-c1cccc(Cl)c1
Show InChI InChI=1S/C15H16ClN3O3S/c16-11-5-3-4-10(8-11)12-9-14(21)18-15(17-12)23-7-2-1-6-13(20)19-22/h3-5,8-9,22H,1-2,6-7H2,(H,19,20)(H,17,18,21)
n/an/a 0.00200n/an/an/an/an/an/a
Universit£ degli Studi di Roma La Sapienza
Curated by ChEMBL
Assay Description
Inhibition of maize HD1-A (mean)
Bioorg Med Chem Lett 17: 1221-5 (2007)
Article DOI: 10.1016/j.bmcl.2006.12.028
BindingDB Entry DOI: 10.7270/Q29W0H0K