BDBM50002967 4-Amino-piperidine-1-carboxylic acid 1-{1-[1-cyclohexylmethyl-2-hydroxy-3-(pyridin-2-ylsulfanyl)-propylcarbamoyl]-2-methylsulfanyl-ethylcarbamoyl}-2-phenyl-ethyl ester::CHEMBL116483
SMILES: CSC[C@H](NC(=O)[C@H](Cc1ccccc1)OC(=O)N1CCC(N)CC1)C(=O)N[C@@H](CC1CCCCC1)[C@@H](O)CSc1ccccn1
InChI Key: InChIKey=XONVKFCNVZUDTQ-KRCBVYEFSA-N
Data: 3 IC50
Activity Spreadsheet -- Enzyme Inhibition Constant Data from BindingDB
Found 3 hits for monomerid = 50002967
Trg + Lig
Ki
nM
ΔG°
kcal/mole
IC50
nM
Kd
nM
EC50/IC50
nM
koff
s-1
kon
M-1s-1
pHTemp
°C
Pepsin A
(Porcine)
BDBM50002967
(4-Amino-piperidine-1-carboxylic acid 1-{1-[1-cyclo...)
Show SMILES CSC[C@H](NC(=O)[C@H](Cc1ccccc1)OC(=O)N1CCC(N)CC1)C(=O)N[C@@H](CC1CCCCC1)[C@@H](O)CSc1ccccn1
Show InChI InChI=1S/C34H49N5O5S2/c1-45-22-28(32(41)37-27(20-24-10-4-2-5-11-24)29(40)23-46-31-14-8-9-17-36-31)38-33(42)30(21-25-12-6-3-7-13-25)44-34(43)39-18-15-26(35)16-19-39/h3,6-9,12-14,17,24,26-30,40H,2,4-5,10-11,15-16,18-23,35H2,1H3,(H,37,41)(H,38,42)/t27-,28-,29-,30-/m0/s1
n/an/a 4.00E+3n/an/an/an/an/an/a
E. Merck Darmstadt
Curated by ChEMBL
Assay Description
In vitro inhibitory activity was measured on porcine pepsin.
J Med Chem 35: 3525-36 (1992)
BindingDB Entry DOI: 10.7270/Q2DB80S4
Renin
(Homo sapiens (Human))
BDBM50002967
(4-Amino-piperidine-1-carboxylic acid 1-{1-[1-cyclo...)
Show SMILES CSC[C@H](NC(=O)[C@H](Cc1ccccc1)OC(=O)N1CCC(N)CC1)C(=O)N[C@@H](CC1CCCCC1)[C@@H](O)CSc1ccccn1
Show InChI InChI=1S/C34H49N5O5S2/c1-45-22-28(32(41)37-27(20-24-10-4-2-5-11-24)29(40)23-46-31-14-8-9-17-36-31)38-33(42)30(21-25-12-6-3-7-13-25)44-34(43)39-18-15-26(35)16-19-39/h3,6-9,12-14,17,24,26-30,40H,2,4-5,10-11,15-16,18-23,35H2,1H3,(H,37,41)(H,38,42)/t27-,28-,29-,30-/m0/s1
Reactome pathway
n/an/a 8.5n/an/an/an/a5.5n/a
E. Merck Darmstadt
Curated by ChEMBL
Assay Description
In vitro inhibitory activity against human plasma renin at pH 5.5 for suppression of angiotensin I formation.
J Med Chem 35: 3525-36 (1992)
BindingDB Entry DOI: 10.7270/Q2DB80S4
Cathepsin D
(Bos taurus)
BDBM50002967
(4-Amino-piperidine-1-carboxylic acid 1-{1-[1-cyclo...)
Show SMILES CSC[C@H](NC(=O)[C@H](Cc1ccccc1)OC(=O)N1CCC(N)CC1)C(=O)N[C@@H](CC1CCCCC1)[C@@H](O)CSc1ccccn1
Show InChI InChI=1S/C34H49N5O5S2/c1-45-22-28(32(41)37-27(20-24-10-4-2-5-11-24)29(40)23-46-31-14-8-9-17-36-31)38-33(42)30(21-25-12-6-3-7-13-25)44-34(43)39-18-15-26(35)16-19-39/h3,6-9,12-14,17,24,26-30,40H,2,4-5,10-11,15-16,18-23,35H2,1H3,(H,37,41)(H,38,42)/t27-,28-,29-,30-/m0/s1
n/an/a>1.00E+4n/an/an/an/an/an/a
E. Merck Darmstadt
Curated by ChEMBL
Assay Description
In vitro inhibitory activity was measured on bovine cathepsin D
J Med Chem 35: 3525-36 (1992)
BindingDB Entry DOI: 10.7270/Q2DB80S4