BDBM50003202 CHEMBL331408::N-(1-Carbamoyl-2-phenyl-ethyl)-3-{2-[2-{3-[2-carboxyamino-3-(4-sulfo-phenyl)-propionylamino]-benzoylamino}-3-(1H-indol-3-yl)-propionylamino]-4-methylsulfanyl-butyrylamino}-succinamic acid
SMILES: CSCC[C@H](NC(=O)[C@H](Cc1c[nH]c2ccccc12)NC(=O)c1cccc(NC(=O)[C@H](Cc2ccc(cc2)S(O)(=O)=O)NC(O)=O)c1)C(=O)N[C@@H](CC(O)=O)C(=O)N[C@@H](Cc1ccccc1)C(N)=O
InChI Key: InChIKey=MYIFBJRCKAELDY-LQWITFIISA-N
Data: 2 IC50
Activity Spreadsheet -- Enzyme Inhibition Constant Data from BindingDB
Found 2 hits for monomerid = 50003202
Trg + Lig
Ki
nM
ΔG°
kcal/mole
IC50
nM
Kd
nM
EC50/IC50
nM
koff
s-1
kon
M-1s-1
pHTemp
°C
Cholecystokinin receptor
(RAT)
BDBM50003202
(CHEMBL331408 | N-(1-Carbamoyl-2-phenyl-ethyl)-3-{2...)
Show SMILES CSCC[C@H](NC(=O)[C@H](Cc1c[nH]c2ccccc12)NC(=O)c1cccc(NC(=O)[C@H](Cc2ccc(cc2)S(O)(=O)=O)NC(O)=O)c1)C(=O)N[C@@H](CC(O)=O)C(=O)N[C@@H](Cc1ccccc1)C(N)=O
Show InChI InChI=1S/C46H50N8O13S2/c1-68-19-18-34(42(59)53-38(24-39(55)56)45(62)51-35(40(47)57)20-26-8-3-2-4-9-26)50-44(61)37(23-29-25-48-33-13-6-5-12-32(29)33)52-41(58)28-10-7-11-30(22-28)49-43(60)36(54-46(63)64)21-27-14-16-31(17-15-27)69(65,66)67/h2-17,22,25,34-38,48,54H,18-21,23-24H2,1H3,(H2,47,57)(H,49,60)(H,50,61)(H,51,62)(H,52,58)(H,53,59)(H,55,56)(H,63,64)(H,65,66,67)/t34-,35-,36-,37-,38-/m0/s1
Reactome pathway
n/an/a 2.10n/an/an/an/an/an/a
Roche Research Center
Curated by ChEMBL
Assay Description
The compound was tested in vitro for inhibition of specific [3H]-propanoyl-CCK-8 binding to Cholecystokinin type A receptor in rat pancreatic membran...
J Med Chem 35: 3774-83 (1992)
BindingDB Entry DOI: 10.7270/Q2CC0ZMG
Cholecystokinin B receptor
(Bos taurus)
BDBM50003202
(CHEMBL331408 | N-(1-Carbamoyl-2-phenyl-ethyl)-3-{2...)
Show SMILES CSCC[C@H](NC(=O)[C@H](Cc1c[nH]c2ccccc12)NC(=O)c1cccc(NC(=O)[C@H](Cc2ccc(cc2)S(O)(=O)=O)NC(O)=O)c1)C(=O)N[C@@H](CC(O)=O)C(=O)N[C@@H](Cc1ccccc1)C(N)=O
Show InChI InChI=1S/C46H50N8O13S2/c1-68-19-18-34(42(59)53-38(24-39(55)56)45(62)51-35(40(47)57)20-26-8-3-2-4-9-26)50-44(61)37(23-29-25-48-33-13-6-5-12-32(29)33)52-41(58)28-10-7-11-30(22-28)49-43(60)36(54-46(63)64)21-27-14-16-31(17-15-27)69(65,66)67/h2-17,22,25,34-38,48,54H,18-21,23-24H2,1H3,(H2,47,57)(H,49,60)(H,50,61)(H,51,62)(H,52,58)(H,53,59)(H,55,56)(H,63,64)(H,65,66,67)/t34-,35-,36-,37-,38-/m0/s1
Reactome pathway
n/an/a 0.480n/an/an/an/an/an/a
Roche Research Center
Curated by ChEMBL
Assay Description
Inhibition of [3H]-propanoyl-CCK-8 binding to Cholecystokinin type B receptor in bovine striatum
J Med Chem 35: 3774-83 (1992)
BindingDB Entry DOI: 10.7270/Q2CC0ZMG