BDBM50003394 2-Methyl-4-{1-[2'-(1H-tetrazol-5-yl)-biphenyl-4-yl]-ethoxy}-quinoline::CHEMBL341223
SMILES: CC(Oc1cc(C)nc2ccccc12)c1ccc(cc1)-c1ccccc1-c1nnn[nH]1
InChI Key: InChIKey=GSBQRUQGRWSSFO-UHFFFAOYSA-N
Data: 1 IC50
Activity Spreadsheet -- Enzyme Inhibition Constant Data from BindingDB
Found 1 hit for monomerid = 50003394
Trg + Lig
Ki
nM
ΔG°
kcal/mole
IC50
nM
Kd
nM
EC50/IC50
nM
koff
s-1
kon
M-1s-1
pHTemp
°C
Type-1 angiotensin II receptor
(Cavia porcellus)
BDBM50003394
(2-Methyl-4-{1-[2'-(1H-tetrazol-5-yl)-biphenyl-4-yl...)
Show SMILES CC(Oc1cc(C)nc2ccccc12)c1ccc(cc1)-c1ccccc1-c1nnn[nH]1
Show InChI InChI=1S/C25H21N5O/c1-16-15-24(22-9-5-6-10-23(22)26-16)31-17(2)18-11-13-19(14-12-18)20-7-3-4-8-21(20)25-27-29-30-28-25/h3-15,17H,1-2H3,(H,27,28,29,30)
n/an/a 40n/an/an/an/an/an/a
ICI Pharmaceuticals
Curated by ChEMBL
Assay Description
In vitro inhibition of the specific binding of [125I]-angiotensin II to a guinea pig adrenal membrane preparation
J Med Chem 35: 4027-38 (1992)
BindingDB Entry DOI: 10.7270/Q2G44P8Q