BDBM50003446 (Z)-3-(Benzyl-hydroxy-amino)-1-(4-fluoro-phenyl)-propenone::3-(Benzyl-hydroxy-amino)-1-(4-fluoro-phenyl)-propenone::CHEMBL11308
SMILES: ON(Cc1ccccc1)\C=C/C(=O)c1ccc(F)cc1
InChI Key: InChIKey=ZUJYYCSNLSCOIM-KHPPLWFESA-N
Data: 4 IC50
Activity Spreadsheet -- Enzyme Inhibition Constant Data from BindingDB
Found 4 hits for monomerid = 50003446
Trg + Lig
Ki
nM
ΔG°
kcal/mole
IC50
nM
Kd
nM
EC50/IC50
nM
koff
s-1
kon
M-1s-1
pHTemp
°C
Arachidonate 5-lipoxygenase
(Rattus norvegicus)
BDBM50003446
((Z)-3-(Benzyl-hydroxy-amino)-1-(4-fluoro-phenyl)-p...)
Show SMILES ON(Cc1ccccc1)\C=C/C(=O)c1ccc(F)cc1
Show InChI InChI=1S/C16H14FNO2/c17-15-8-6-14(7-9-15)16(19)10-11-18(20)12-13-4-2-1-3-5-13/h1-11,20H,12H2/b11-10-
n/an/a 150n/an/an/an/an/an/a
Du Pont Merck Pharmaceutical Company
Curated by ChEMBL
Assay Description
inhibitory activity against 5-lipoxygenase in rat basophilic leukemia cell line.
J Med Chem 35: 4061-8 (1992)
BindingDB Entry DOI: 10.7270/Q2BC3XHJ
Cyclooxygenase
(Bos taurus)
BDBM50003446
((Z)-3-(Benzyl-hydroxy-amino)-1-(4-fluoro-phenyl)-p...)
Show SMILES ON(Cc1ccccc1)\C=C/C(=O)c1ccc(F)cc1
Show InChI InChI=1S/C16H14FNO2/c17-15-8-6-14(7-9-15)16(19)10-11-18(20)12-13-4-2-1-3-5-13/h1-11,20H,12H2/b11-10-
n/an/a>7.50E+5n/an/an/an/an/an/a
TBA
Curated by ChEMBL
Assay Description
Compound was evaluated for inhibition against cyclooxygenase of bovine seminal vesicles
Bioorg Med Chem Lett 2: 1079-1084 (1992)
Article DOI: 10.1016/S0960-894X(00)80622-8
BindingDB Entry DOI: 10.7270/Q2S75G70
Arachidonate 5-lipoxygenase
(Rattus norvegicus)
BDBM50003446
((Z)-3-(Benzyl-hydroxy-amino)-1-(4-fluoro-phenyl)-p...)
Show SMILES ON(Cc1ccccc1)\C=C/C(=O)c1ccc(F)cc1
Show InChI InChI=1S/C16H14FNO2/c17-15-8-6-14(7-9-15)16(19)10-11-18(20)12-13-4-2-1-3-5-13/h1-11,20H,12H2/b11-10-
n/an/a 150n/an/an/an/an/an/a
TBA
Curated by ChEMBL
Assay Description
Inhibition of 5-Lipoxygenase of rat basophilic leukemia cells
Bioorg Med Chem Lett 2: 1079-1084 (1992)
Article DOI: 10.1016/S0960-894X(00)80622-8
BindingDB Entry DOI: 10.7270/Q2S75G70
Phospholipase A2, membrane associated
(Homo sapiens (Human))
BDBM50003446
((Z)-3-(Benzyl-hydroxy-amino)-1-(4-fluoro-phenyl)-p...)
Show SMILES ON(Cc1ccccc1)\C=C/C(=O)c1ccc(F)cc1
Show InChI InChI=1S/C16H14FNO2/c17-15-8-6-14(7-9-15)16(19)10-11-18(20)12-13-4-2-1-3-5-13/h1-11,20H,12H2/b11-10-
NCI pathway
Reactome pathway
n/an/a>1.00E+6n/an/an/an/an/an/a
TBA
Curated by ChEMBL
Assay Description
Compound was evaluated for inhibition against Phospholipase A2 of Croatalus adamanteus
Bioorg Med Chem Lett 2: 1079-1084 (1992)
Article DOI: 10.1016/S0960-894X(00)80622-8
BindingDB Entry DOI: 10.7270/Q2S75G70