BDBM50003643 CHEMBL484477
SMILES: COc1cc(CN\C=C2/C(=O)NC(=O)c3ccc(Br)cc23)cc(O)c1OC
InChI Key: InChIKey=WQLDJWGOTMSDSG-ZROIWOOFSA-N
Data: 3 IC50
Activity Spreadsheet -- Enzyme Inhibition Constant Data from BindingDB
Found 3 hits for monomerid = 50003643
Trg + Lig
Ki
nM
ΔG°
kcal/mole
IC50
nM
Kd
nM
EC50/IC50
nM
koff
s-1
kon
M-1s-1
pHTemp
°C
Cyclin-dependent kinase 1
(Homo sapiens (Human))
BDBM50003643
(CHEMBL484477)
Show SMILES COc1cc(CN\C=C2/C(=O)NC(=O)c3ccc(Br)cc23)cc(O)c1OC
Show InChI InChI=1S/C19H17BrN2O5/c1-26-16-6-10(5-15(23)17(16)27-2)8-21-9-14-13-7-11(20)3-4-12(13)18(24)22-19(14)25/h3-7,9,21,23H,8H2,1-2H3,(H,22,24,25)/b14-9-
Reactome pathway
n/an/a<5.00E+4n/an/an/an/an/an/a
Wyeth Research
Curated by ChEMBL
Assay Description
Inhibition of CDK1/Cyclin B1 (unknown origin) assessed as inhibition of retinoblastoma susceptibility gene product phosphorylation
J Med Chem 52: 2289-310 (2009)
Article DOI: 10.1021/jm801026e
BindingDB Entry DOI: 10.7270/Q27H1JG7
Cyclin-dependent kinase 4
(Homo sapiens (Human))
BDBM50003643
(CHEMBL484477)
Show SMILES COc1cc(CN\C=C2/C(=O)NC(=O)c3ccc(Br)cc23)cc(O)c1OC
Show InChI InChI=1S/C19H17BrN2O5/c1-26-16-6-10(5-15(23)17(16)27-2)8-21-9-14-13-7-11(20)3-4-12(13)18(24)22-19(14)25/h3-7,9,21,23H,8H2,1-2H3,(H,22,24,25)/b14-9-
NCI pathway
Reactome pathway
n/an/a<7n/an/an/an/an/an/a
Wyeth Research
Curated by ChEMBL
Assay Description
Inhibition of CDK4/Cyclin D1 (unknown origin) assessed as inhibition of retinoblastoma susceptibility gene product phosphorylation
J Med Chem 52: 2289-310 (2009)
Article DOI: 10.1021/jm801026e
BindingDB Entry DOI: 10.7270/Q27H1JG7
Cyclin-dependent kinase 2
(Homo sapiens (Human))
BDBM50003643
(CHEMBL484477)
Show SMILES COc1cc(CN\C=C2/C(=O)NC(=O)c3ccc(Br)cc23)cc(O)c1OC
Show InChI InChI=1S/C19H17BrN2O5/c1-26-16-6-10(5-15(23)17(16)27-2)8-21-9-14-13-7-11(20)3-4-12(13)18(24)22-19(14)25/h3-7,9,21,23H,8H2,1-2H3,(H,22,24,25)/b14-9-
NCI pathway
Reactome pathway
n/an/a<5.00E+4n/an/an/an/an/an/a
Wyeth Research
Curated by ChEMBL
Assay Description
Inhibition of CDK2/Cyclin E (unknown origin) assessed as inhibition of retinoblastoma susceptibility gene product phosphorylation
J Med Chem 52: 2289-310 (2009)
Article DOI: 10.1021/jm801026e
BindingDB Entry DOI: 10.7270/Q27H1JG7