null
SMILES: Clc1ccc2c(NCCNC(=S)NCC=C)ccnc2c1
InChI Key: InChIKey=SWKRGDLZSKBUDG-UHFFFAOYSA-N
Activity Spreadsheet -- Enzyme Inhibition Constant Data from BindingDB
Found 1 hit for monomerid = 50003654
Trg + Lig
Ki
nM
ΔG°
kcal/mole
IC50
nM
Kd
nM
EC50/IC50
nM
koff
s-1
kon
M-1s-1
pHTemp
°C
Histidine-rich protein PFHRP-II
(Plasmodium falciparum)
BDBM50003654
(CHEMBL466898)
Show SMILES Clc1ccc2c(NCCNC(=S)NCC=C)ccnc2c1
Show InChI InChI=1S/C15H17ClN4S/c1-2-6-19-15(21)20-9-8-18-13-5-7-17-14-10-11(16)3-4-12(13)14/h2-5,7,10H,1,6,8-9H2,(H,17,18)(H2,19,20,21)
n/an/a 7.30n/an/an/an/an/an/a
Central Drug Research Institute
Curated by ChEMBL
Assay Description
Antiplasmodial activity as inhibition of beta-hematin against Plasmodium yoelii N67 infected Swiss mice (Mus musculus) erythrocytes
Bioorg Med Chem Lett 19: 2570-3 (2009)
Article DOI: 10.1016/j.bmcl.2009.03.026
BindingDB Entry DOI: 10.7270/Q2JD4Z8D