BDBM50003710 CHEMBL3234964
SMILES: Nc1nc(SCc2csc(n2)N2CCOCC2)nc(-c2ccc3OCOc3c2)c1C#N
InChI Key: InChIKey=YECDAMHUKHGDJA-UHFFFAOYSA-N
Data: 1 KI  1 EC50
Activity Spreadsheet -- Enzyme Inhibition Constant Data from BindingDB
Found 2 hits for monomerid = 50003710
Trg + Lig
Ki
nM
ΔG°
kcal/mole
IC50
nM
Kd
nM
EC50/IC50
nM
koff
s-1
kon
M-1s-1
pHTemp
°C
Adenosine receptor A1
(Homo sapiens (Human))
BDBM50003710
(CHEMBL3234964)
Show SMILES Nc1nc(SCc2csc(n2)N2CCOCC2)nc(-c2ccc3OCOc3c2)c1C#N
Show InChI InChI=1S/C20H18N6O3S2/c21-8-14-17(12-1-2-15-16(7-12)29-11-28-15)24-19(25-18(14)22)30-9-13-10-31-20(23-13)26-3-5-27-6-4-26/h1-2,7,10H,3-6,9,11H2,(H2,22,24,25)
Reactome pathway
1.90n/an/an/an/an/an/an/an/a
Leiden University
Curated by ChEMBL
Assay Description
Displacement of [3H]DPCPX from human adenosine A1 receptor expressed in CHO cell membranes after 1 hr by beta scintillation counting analysis
J Med Chem 57: 3213-22 (2014)
Article DOI: 10.1021/jm401643m
BindingDB Entry DOI: 10.7270/Q27P90X6
Adenosine receptor A1
(Homo sapiens (Human))
BDBM50003710
(CHEMBL3234964)
Show SMILES Nc1nc(SCc2csc(n2)N2CCOCC2)nc(-c2ccc3OCOc3c2)c1C#N
Show InChI InChI=1S/C20H18N6O3S2/c21-8-14-17(12-1-2-15-16(7-12)29-11-28-15)24-19(25-18(14)22)30-9-13-10-31-20(23-13)26-3-5-27-6-4-26/h1-2,7,10H,3-6,9,11H2,(H2,22,24,25)
Reactome pathway
n/an/an/an/a 1.80n/an/an/an/a
Leiden University
Curated by ChEMBL
Assay Description
Agonist activity human adenosine A1 receptor expressed in CHO cell membranes assessed as stimulation of [35S]GTPgammaS binding preincubated for 30 mi...
J Med Chem 57: 3213-22 (2014)
Article DOI: 10.1021/jm401643m
BindingDB Entry DOI: 10.7270/Q27P90X6