BDBM50003784 8-(4-Chloro-benzenesulfonylamino)-4-[3-(4-methyl-pyridin-3-yl)-propyl]-octanoic acid::CHEMBL137402
SMILES: Cc1ccncc1CCCC(CCCCNS(=O)(=O)c1ccc(Cl)cc1)CCC(O)=O
InChI Key: InChIKey=AYCXRQBBLSMBJB-UHFFFAOYSA-N
Data: 1 IC50
Activity Spreadsheet -- Enzyme Inhibition Constant Data from BindingDB
Found 1 hit for monomerid = 50003784
Trg + Lig
Ki
nM
ΔG°
kcal/mole
IC50
nM
Kd
nM
EC50/IC50
nM
koff
s-1
kon
M-1s-1
pHTemp
°C
Thromboxane A2 Synthase (P450 TxA2)
(Homo sapiens (Human))
BDBM50003784
(8-(4-Chloro-benzenesulfonylamino)-4-[3-(4-methyl-p...)
Show SMILES Cc1ccncc1CCCC(CCCCNS(=O)(=O)c1ccc(Cl)cc1)CCC(O)=O
Show InChI InChI=1S/C23H31ClN2O4S/c1-18-14-16-25-17-20(18)7-4-6-19(8-13-23(27)28)5-2-3-15-26-31(29,30)22-11-9-21(24)10-12-22/h9-12,14,16-17,19,26H,2-8,13,15H2,1H3,(H,27,28)
n/an/a 1n/an/an/an/an/an/a
CIBA-GEIGY Corporation
Curated by ChEMBL
Assay Description
In vitro inhibition of Thromboxane A2 synthase
J Med Chem 35: 4373-83 (1992)
BindingDB Entry DOI: 10.7270/Q2F47N3W