BDBM50003815 CHEMBL3235321
SMILES: CC1(C)Oc2nc(nc(N)c2N=C1c1ccc2c(CC[C@@]22CC[C@H](CC(O)=O)CC2)c1)C(F)(F)F
InChI Key: InChIKey=YFJNLPDVCDNOMJ-OJPDTXNBSA-N
Data: 5 IC50
Activity Spreadsheet -- Enzyme Inhibition Constant Data from BindingDB
Found 5 hits for monomerid = 50003815
Trg + Lig
Ki
nM
ΔG°
kcal/mole
IC50
nM
Kd
nM
EC50/IC50
nM
koff
s-1
kon
M-1s-1
pHTemp
°C
Sterol O-acyltransferase 1
(Homo sapiens (Human))
BDBM50003815
(CHEMBL3235321)
Show SMILES CC1(C)Oc2nc(nc(N)c2N=C1c1ccc2c(CC[C@@]22CC[C@H](CC(O)=O)CC2)c1)C(F)(F)F |r,wU:20.22,wD:23.26,c:12,(27.23,-21.22,;25.69,-21.22,;26.46,-22.55,;24.36,-22,;23.03,-21.23,;21.69,-22.01,;20.36,-21.24,;20.36,-19.69,;21.69,-18.92,;21.68,-17.38,;23.02,-19.69,;24.35,-18.91,;25.69,-19.67,;27.02,-18.9,;27,-17.37,;28.32,-16.58,;29.67,-17.35,;29.68,-18.88,;31.15,-19.35,;32.04,-18.1,;31.12,-16.86,;30.02,-15.78,;30.42,-14.29,;31.91,-13.88,;32.3,-12.39,;33.79,-11.99,;34.89,-13.08,;34.19,-10.5,;33,-14.97,;32.61,-16.45,;28.35,-19.66,;19.02,-22.01,;17.69,-21.24,;19.02,-23.55,;17.68,-22.77,)|
Show InChI InChI=1S/C25H27F3N4O3/c1-23(2)19(30-18-20(29)31-22(25(26,27)28)32-21(18)35-23)15-3-4-16-14(12-15)7-10-24(16)8-5-13(6-9-24)11-17(33)34/h3-4,12-13H,5-11H2,1-2H3,(H,33,34)(H2,29,31,32)/t13-,24-
n/an/a>1.00E+4n/an/an/an/an/an/a
Amgen Inc.
Curated by ChEMBL
Assay Description
Inhibition of human full-length flag-tagged ACAT1 expressed in baculovirus infected insect cells using [14C]palmitoyl CoA as substrate after 10 mins ...
J Med Chem 57: 3464-83 (2014)
Article DOI: 10.1021/jm500135c
BindingDB Entry DOI: 10.7270/Q23X886W
Diacylglycerol O-acyltransferase 2
(Homo sapiens (Human))
BDBM50003815
(CHEMBL3235321)
Show SMILES CC1(C)Oc2nc(nc(N)c2N=C1c1ccc2c(CC[C@@]22CC[C@H](CC(O)=O)CC2)c1)C(F)(F)F |r,wU:20.22,wD:23.26,c:12,(27.23,-21.22,;25.69,-21.22,;26.46,-22.55,;24.36,-22,;23.03,-21.23,;21.69,-22.01,;20.36,-21.24,;20.36,-19.69,;21.69,-18.92,;21.68,-17.38,;23.02,-19.69,;24.35,-18.91,;25.69,-19.67,;27.02,-18.9,;27,-17.37,;28.32,-16.58,;29.67,-17.35,;29.68,-18.88,;31.15,-19.35,;32.04,-18.1,;31.12,-16.86,;30.02,-15.78,;30.42,-14.29,;31.91,-13.88,;32.3,-12.39,;33.79,-11.99,;34.89,-13.08,;34.19,-10.5,;33,-14.97,;32.61,-16.45,;28.35,-19.66,;19.02,-22.01,;17.69,-21.24,;19.02,-23.55,;17.68,-22.77,)|
Show InChI InChI=1S/C25H27F3N4O3/c1-23(2)19(30-18-20(29)31-22(25(26,27)28)32-21(18)35-23)15-3-4-16-14(12-15)7-10-24(16)8-5-13(6-9-24)11-17(33)34/h3-4,12-13H,5-11H2,1-2H3,(H,33,34)(H2,29,31,32)/t13-,24-
Reactome pathway
n/an/a>1.00E+4n/an/an/an/an/an/a
Amgen Inc.
Curated by ChEMBL
Assay Description
Inhibition of human liver flag-tagged DGAT2 expressed in baculovirus infected insect cells after 2 hrs by SPA
J Med Chem 57: 3464-83 (2014)
Article DOI: 10.1021/jm500135c
BindingDB Entry DOI: 10.7270/Q23X886W
Diacylglycerol O-acyltransferase 1
(Homo sapiens (Human))
BDBM50003815
(CHEMBL3235321)
Show SMILES CC1(C)Oc2nc(nc(N)c2N=C1c1ccc2c(CC[C@@]22CC[C@H](CC(O)=O)CC2)c1)C(F)(F)F |r,wU:20.22,wD:23.26,c:12,(27.23,-21.22,;25.69,-21.22,;26.46,-22.55,;24.36,-22,;23.03,-21.23,;21.69,-22.01,;20.36,-21.24,;20.36,-19.69,;21.69,-18.92,;21.68,-17.38,;23.02,-19.69,;24.35,-18.91,;25.69,-19.67,;27.02,-18.9,;27,-17.37,;28.32,-16.58,;29.67,-17.35,;29.68,-18.88,;31.15,-19.35,;32.04,-18.1,;31.12,-16.86,;30.02,-15.78,;30.42,-14.29,;31.91,-13.88,;32.3,-12.39,;33.79,-11.99,;34.89,-13.08,;34.19,-10.5,;33,-14.97,;32.61,-16.45,;28.35,-19.66,;19.02,-22.01,;17.69,-21.24,;19.02,-23.55,;17.68,-22.77,)|
Show InChI InChI=1S/C25H27F3N4O3/c1-23(2)19(30-18-20(29)31-22(25(26,27)28)32-21(18)35-23)15-3-4-16-14(12-15)7-10-24(16)8-5-13(6-9-24)11-17(33)34/h3-4,12-13H,5-11H2,1-2H3,(H,33,34)(H2,29,31,32)/t13-,24-
n/an/a 3n/an/an/an/an/an/a
Amgen Inc.
Curated by ChEMBL
Assay Description
Inhibition of DGAT1 (unknown origin) by cell-based assay
J Med Chem 57: 3464-83 (2014)
Article DOI: 10.1021/jm500135c
BindingDB Entry DOI: 10.7270/Q23X886W
Diacylglycerol O-acyltransferase 1
(Homo sapiens (Human))
BDBM50003815
(CHEMBL3235321)
Show SMILES CC1(C)Oc2nc(nc(N)c2N=C1c1ccc2c(CC[C@@]22CC[C@H](CC(O)=O)CC2)c1)C(F)(F)F |r,wU:20.22,wD:23.26,c:12,(27.23,-21.22,;25.69,-21.22,;26.46,-22.55,;24.36,-22,;23.03,-21.23,;21.69,-22.01,;20.36,-21.24,;20.36,-19.69,;21.69,-18.92,;21.68,-17.38,;23.02,-19.69,;24.35,-18.91,;25.69,-19.67,;27.02,-18.9,;27,-17.37,;28.32,-16.58,;29.67,-17.35,;29.68,-18.88,;31.15,-19.35,;32.04,-18.1,;31.12,-16.86,;30.02,-15.78,;30.42,-14.29,;31.91,-13.88,;32.3,-12.39,;33.79,-11.99,;34.89,-13.08,;34.19,-10.5,;33,-14.97,;32.61,-16.45,;28.35,-19.66,;19.02,-22.01,;17.69,-21.24,;19.02,-23.55,;17.68,-22.77,)|
Show InChI InChI=1S/C25H27F3N4O3/c1-23(2)19(30-18-20(29)31-22(25(26,27)28)32-21(18)35-23)15-3-4-16-14(12-15)7-10-24(16)8-5-13(6-9-24)11-17(33)34/h3-4,12-13H,5-11H2,1-2H3,(H,33,34)(H2,29,31,32)/t13-,24-
n/an/a 4n/an/an/an/an/an/a
Amgen Inc.
Curated by ChEMBL
Assay Description
Inhibition of human liver flag-tagged DGAT1 expressed in baculovirus infected insect cells after 2 hrs by SPA
J Med Chem 57: 3464-83 (2014)
Article DOI: 10.1021/jm500135c
BindingDB Entry DOI: 10.7270/Q23X886W
Sterol O-acyltransferase 2
(Homo sapiens (Human))
BDBM50003815
(CHEMBL3235321)
Show SMILES CC1(C)Oc2nc(nc(N)c2N=C1c1ccc2c(CC[C@@]22CC[C@H](CC(O)=O)CC2)c1)C(F)(F)F |r,wU:20.22,wD:23.26,c:12,(27.23,-21.22,;25.69,-21.22,;26.46,-22.55,;24.36,-22,;23.03,-21.23,;21.69,-22.01,;20.36,-21.24,;20.36,-19.69,;21.69,-18.92,;21.68,-17.38,;23.02,-19.69,;24.35,-18.91,;25.69,-19.67,;27.02,-18.9,;27,-17.37,;28.32,-16.58,;29.67,-17.35,;29.68,-18.88,;31.15,-19.35,;32.04,-18.1,;31.12,-16.86,;30.02,-15.78,;30.42,-14.29,;31.91,-13.88,;32.3,-12.39,;33.79,-11.99,;34.89,-13.08,;34.19,-10.5,;33,-14.97,;32.61,-16.45,;28.35,-19.66,;19.02,-22.01,;17.69,-21.24,;19.02,-23.55,;17.68,-22.77,)|
Show InChI InChI=1S/C25H27F3N4O3/c1-23(2)19(30-18-20(29)31-22(25(26,27)28)32-21(18)35-23)15-3-4-16-14(12-15)7-10-24(16)8-5-13(6-9-24)11-17(33)34/h3-4,12-13H,5-11H2,1-2H3,(H,33,34)(H2,29,31,32)/t13-,24-
n/an/a>1.00E+4n/an/an/an/an/an/a
Amgen Inc.
Curated by ChEMBL
Assay Description
Inhibition of human full-length flag-tagged ACAT2 expressed in baculovirus infected insect cells using [14C]palmitoyl CoA as substrate after 10 mins ...
J Med Chem 57: 3464-83 (2014)
Article DOI: 10.1021/jm500135c
BindingDB Entry DOI: 10.7270/Q23X886W