BDBM50003894 CHEMBL3235345
SMILES: CC(C)Nc1cc(cc2CCNC(=O)c12)-n1c2CN(C)CCc2c2c1CC(C)(C)CC2=O
InChI Key: InChIKey=SAYWXJCRCITRBW-UHFFFAOYSA-N
Data: 4 KI  1 IC50
PDB links: 1 PDB ID matches this monomer.
Activity Spreadsheet -- Enzyme Inhibition Constant Data from BindingDB
Found 5 hits for monomerid = 50003894
Trg + Lig
Ki
nM
ΔG°
kcal/mole
IC50
nM
Kd
nM
EC50/IC50
nM
koff
s-1
kon
M-1s-1
pHTemp
°C
Heat shock protein HSP 90-beta
(Homo sapiens (Human))
BDBM50003894
(CHEMBL3235345)
Show SMILES CC(C)Nc1cc(cc2CCNC(=O)c12)-n1c2CN(C)CCc2c2c1CC(C)(C)CC2=O
Show InChI InChI=1S/C26H34N4O2/c1-15(2)28-19-11-17(10-16-6-8-27-25(32)23(16)19)30-20-12-26(3,4)13-22(31)24(20)18-7-9-29(5)14-21(18)30/h10-11,15,28H,6-9,12-14H2,1-5H3,(H,27,32)
Reactome pathway
30n/an/an/an/an/an/an/an/a
Vertex Pharmaceuticals , 11010 Torreyana Road, San Diego, California 92121, United States.
Curated by ChEMBL
Assay Description
Displacement of FITC-geldanamycin from recombinant HSP90beta (unknown origin) after 2 hrs by fluorescence polarization assay
J Med Chem 57: 3382-400 (2014)
Article DOI: 10.1021/jm500042s
BindingDB Entry DOI: 10.7270/Q2057HGG
3D
3D Structure (crystal)
Heat shock protein HSP 90-alpha
(Homo sapiens (Human))
BDBM50003894
(CHEMBL3235345)
Show SMILES CC(C)Nc1cc(cc2CCNC(=O)c12)-n1c2CN(C)CCc2c2c1CC(C)(C)CC2=O
Show InChI InChI=1S/C26H34N4O2/c1-15(2)28-19-11-17(10-16-6-8-27-25(32)23(16)19)30-20-12-26(3,4)13-22(31)24(20)18-7-9-29(5)14-21(18)30/h10-11,15,28H,6-9,12-14H2,1-5H3,(H,27,32)
NCI pathway
Reactome pathway
37n/an/an/an/an/an/an/an/a
Vertex Pharmaceuticals , 11010 Torreyana Road, San Diego, California 92121, United States.
Curated by ChEMBL
Assay Description
Displacement of FITC-geldanamycin from recombinant HSP90alpha (unknown origin) after 2 hrs by fluorescence polarization assay
J Med Chem 57: 3382-400 (2014)
Article DOI: 10.1021/jm500042s
BindingDB Entry DOI: 10.7270/Q2057HGG
3D
3D Structure (crystal)
Endoplasmin
(Homo sapiens (Human))
BDBM50003894
(CHEMBL3235345)
Show SMILES CC(C)Nc1cc(cc2CCNC(=O)c12)-n1c2CN(C)CCc2c2c1CC(C)(C)CC2=O
Show InChI InChI=1S/C26H34N4O2/c1-15(2)28-19-11-17(10-16-6-8-27-25(32)23(16)19)30-20-12-26(3,4)13-22(31)24(20)18-7-9-29(5)14-21(18)30/h10-11,15,28H,6-9,12-14H2,1-5H3,(H,27,32)
>1.00E+4n/an/an/an/an/an/an/an/a
Vertex Pharmaceuticals , 11010 Torreyana Road, San Diego, California 92121, United States.
Curated by ChEMBL
Assay Description
Displacement of FITC-geldanamycin from recombinant GRP94 (unknown origin) after 2 hrs by fluorescence polarization assay
J Med Chem 57: 3382-400 (2014)
Article DOI: 10.1021/jm500042s
BindingDB Entry DOI: 10.7270/Q2057HGG
Heat shock protein 75 kDa, mitochondrial
(Homo sapiens (Human))
BDBM50003894
(CHEMBL3235345)
Show SMILES CC(C)Nc1cc(cc2CCNC(=O)c12)-n1c2CN(C)CCc2c2c1CC(C)(C)CC2=O
Show InChI InChI=1S/C26H34N4O2/c1-15(2)28-19-11-17(10-16-6-8-27-25(32)23(16)19)30-20-12-26(3,4)13-22(31)24(20)18-7-9-29(5)14-21(18)30/h10-11,15,28H,6-9,12-14H2,1-5H3,(H,27,32)
>1.00E+4n/an/an/an/an/an/an/an/a
Vertex Pharmaceuticals , 11010 Torreyana Road, San Diego, California 92121, United States.
Curated by ChEMBL
Assay Description
Displacement of FITC-geldanamycin from recombinant TRAP1 (unknown origin) after 2 hrs by fluorescence polarization assay
J Med Chem 57: 3382-400 (2014)
Article DOI: 10.1021/jm500042s
BindingDB Entry DOI: 10.7270/Q2057HGG
Heat shock protein HSP 90-beta
(Homo sapiens (Human))
BDBM50003894
(CHEMBL3235345)
Show SMILES CC(C)Nc1cc(cc2CCNC(=O)c12)-n1c2CN(C)CCc2c2c1CC(C)(C)CC2=O
Show InChI InChI=1S/C26H34N4O2/c1-15(2)28-19-11-17(10-16-6-8-27-25(32)23(16)19)30-20-12-26(3,4)13-22(31)24(20)18-7-9-29(5)14-21(18)30/h10-11,15,28H,6-9,12-14H2,1-5H3,(H,27,32)
Reactome pathway
n/an/a 73n/an/an/an/an/an/a
Vertex Pharmaceuticals , 11010 Torreyana Road, San Diego, California 92121, United States.
Curated by ChEMBL
Assay Description
Inhibition of HSP90 in HEK cells expressing full-length mHtt Q73 gene assessed as reduction of mHtt level after 24 hrs by Western blot analysis
J Med Chem 57: 3382-400 (2014)
Article DOI: 10.1021/jm500042s
BindingDB Entry DOI: 10.7270/Q2057HGG
3D
3D Structure (crystal)