BDBM50004035 CHEMBL433678::N-(2-(2-(1-benzylpiperidin-4-yl)ethyl)-1,3-dioxoisoindolin-5-yl)acetamide::N-{2-[2-(1-Benzyl-piperidin-4-yl)-ethyl]-1,3-dioxo-2,3-dihydro-1H-isoindol-5-yl}-acetamide
SMILES: CC(=O)Nc1ccc2C(=O)N(CCC3CCN(Cc4ccccc4)CC3)C(=O)c2c1
InChI Key: InChIKey=IYQDVAQDSMLFBE-UHFFFAOYSA-N
Data: 2 IC50
Activity Spreadsheet -- Enzyme Inhibition Constant Data from BindingDB
Found 2 hits for monomerid = 50004035
Trg + Lig
Ki
nM
ΔG°
kcal/mole
IC50
nM
Kd
nM
EC50/IC50
nM
koff
s-1
kon
M-1s-1
pHTemp
°C
Acetylcholinesterase
(Homo sapiens (Human))
BDBM50004035
(CHEMBL433678 | N-(2-(2-(1-benzylpiperidin-4-yl)eth...)
Show SMILES CC(=O)Nc1ccc2C(=O)N(CCC3CCN(Cc4ccccc4)CC3)C(=O)c2c1
Show InChI InChI=1S/C24H27N3O3/c1-17(28)25-20-7-8-21-22(15-20)24(30)27(23(21)29)14-11-18-9-12-26(13-10-18)16-19-5-3-2-4-6-19/h2-8,15,18H,9-14,16H2,1H3,(H,25,28)
NCI pathway
Reactome pathway
n/an/a 2.80n/an/an/an/an/an/a
Sichuan University
Curated by ChEMBL
Assay Description
Inhibition of AChE
Eur J Med Chem 45: 1167-72 (2010)
Article DOI: 10.1016/j.ejmech.2009.12.038
BindingDB Entry DOI: 10.7270/Q25H7GFM
Acetylcholinesterase
(Mus musculus (mouse))
BDBM50004035
(CHEMBL433678 | N-(2-(2-(1-benzylpiperidin-4-yl)eth...)
Show SMILES CC(=O)Nc1ccc2C(=O)N(CCC3CCN(Cc4ccccc4)CC3)C(=O)c2c1
Show InChI InChI=1S/C24H27N3O3/c1-17(28)25-20-7-8-21-22(15-20)24(30)27(23(21)29)14-11-18-9-12-26(13-10-18)16-19-5-3-2-4-6-19/h2-8,15,18H,9-14,16H2,1H3,(H,25,28)
Reactome pathway
n/an/a 2.80n/an/an/an/an/an/a
Eisai Co., Ltd.
Curated by ChEMBL
Assay Description
In vitro inhibitory concentration against acetylcholinesterase (AChE) obtained from mouse brain homogenate.
J Med Chem 35: 4542-8 (1993)
BindingDB Entry DOI: 10.7270/Q25M64P8