BDBM50004081 CHEMBL2180797
SMILES: Cn1ncc(C(=O)N2CCC2)c1C(=O)Nc1ccn2cc(nc2c1)-c1ccccc1
InChI Key: InChIKey=SPLGVDFEALBUOC-UHFFFAOYSA-N
Data: 1 IC50
Activity Spreadsheet -- Enzyme Inhibition Constant Data from BindingDB
Found 1 hit for monomerid = 50004081
Trg + Lig
Ki
nM
ΔG°
kcal/mole
IC50
nM
Kd
nM
EC50/IC50
nM
koff
s-1
kon
M-1s-1
pHTemp
°C
cAMP and cAMP-inhibited cGMP 3',5'-cyclic phosphodiesterase 10A
(Homo sapiens (Human))
BDBM50004081
(CHEMBL2180797)
Show SMILES Cn1ncc(C(=O)N2CCC2)c1C(=O)Nc1ccn2cc(nc2c1)-c1ccccc1
Show InChI InChI=1S/C22H20N6O2/c1-26-20(17(13-23-26)22(30)27-9-5-10-27)21(29)24-16-8-11-28-14-18(25-19(28)12-16)15-6-3-2-4-7-15/h2-4,6-8,11-14H,5,9-10H2,1H3,(H,24,29)
Reactome pathway
n/an/a<0.100n/an/an/an/an/an/a
Pfizer Inc.
Curated by ChEMBL
Assay Description
Inhibition of PDEDA2 using [3H]cGMP as substrate after 30 mins by scintillation proximity assay
J Med Chem 55: 7299-331 (2012)
Article DOI: 10.1021/jm3004976
BindingDB Entry DOI: 10.7270/Q2C24XJK